<testsuites tests="985" failures="0">
    <testsuite name="AblyTests" tests="972" failures="0" skipped="0" time="1761.282612323761">
        <properties>
          <property name="Configuration" value="Test Scheme Action"/>
        </properties>
        <testcase classname="ARTDefaultTests" name="testVersions()" time="0.006260037422180176">
        </testcase>
        <testcase classname="AttachRetryStateTests" name="test_addRetryAttempt()" time="0.0029190778732299805">
        </testcase>
        <testcase classname="AttachRetryStateTests" name="test_transitionToAttachingOrSuspendedStateDoesNotResetRetrySequence()" time="0.3558390140533447">
        </testcase>
        <testcase classname="AttachRetryStateTests" name="test_transitionToNonAttachingOrSuspendedStateResetsRetrySequence()" time="0.0020650625228881836">
        </testcase>
        <testcase classname="AuthTests" name="test__001__should_not_force_token_auth_when_clientId_is_set()" time="3.192254066467285">
        </testcase>
        <testcase classname="AuthTests" name="test__002__should_accept_authURL_response_with_timestamp_argument_as_string()" time="0.6110619306564331">
        </testcase>
        <testcase classname="AuthTests" name="test__003__Basic__should_work_over_HTTPS_only()" time="0.004675030708312988">
        </testcase>
        <testcase classname="AuthTests" name="test__004__Basic__should_send_the_API_key_in_the_Authorization_header()" time="0.21256709098815918">
        </testcase>
        <testcase classname="AuthTests" name="test__005__Basic__should_be_default_when_an_API_key_is_set()" time="0.0008529424667358398">
        </testcase>
        <testcase classname="AuthTests" name="test__006__Token__TTL_should_default_to_be_omitted()" time="0.001037001609802246">
        </testcase>
        <testcase classname="AuthTests" name="test__007__Token__should_URL_query_be_correctly_encoded()" time="0.006286025047302246">
        </testcase>
        <testcase classname="AuthTests" name="test__008__Token__should_omit_capability_field_if_it_is_not_specified()" time="0.26865196228027344">
        </testcase>
        <testcase classname="AuthTests" name="test__009__Token__should_add_capability_field_if_the_user_specifies_it()" time="0.22748100757598877">
        </testcase>
        <testcase classname="AuthTests" name="test__010__Token__token_auth__should_work_over_HTTP()" time="0.34334897994995117">
        </testcase>
        <testcase classname="AuthTests" name="test__011__Token__token_auth__should_work_over_HTTPS()" time="0.39775896072387695">
        </testcase>
        <testcase classname="AuthTests" name="test__012__Token__token_auth__for_REST_requests__should_send_the_token_in_the_Authorization_header()" time="0.5138729810714722">
        </testcase>
        <testcase classname="AuthTests" name="test__013__Token__token_auth__for_Realtime_connections__should_send_the_token_in_the_querystring_as_a_param_named_accessToken()" time="0.18857192993164062">
        </testcase>
        <testcase classname="AuthTests" name="test__014__Token__authentication_method__should_be_default_auth_method_when_options__useTokenAuth_is_set()" time="0.0009659528732299805">
        </testcase>
        <testcase classname="AuthTests" name="test__015__Token__authentication_method__should_be_default_auth_method_when_options__authUrl_is_set()" time="0.0007480382919311523">
        </testcase>
        <testcase classname="AuthTests" name="test__016__Token__authentication_method__should_be_default_auth_method_when_options__authCallback_is_set()" time="0.0035369396209716797">
        </testcase>
        <testcase classname="AuthTests" name="test__017__Token__authentication_method__should_be_default_auth_method_when_options__tokenDetails_is_set()" time="0.0004709959030151367">
        </testcase>
        <testcase classname="AuthTests" name="test__018__Token__authentication_method__should_be_default_auth_method_when_options__token_is_set()" time="0.0004680156707763672">
        </testcase>
        <testcase classname="AuthTests" name="test__019__Token__authentication_method__should_be_default_auth_method_when_options__key_is_set()" time="0.008549928665161133">
        </testcase>
        <testcase classname="AuthTests" name="test__020__Token__authentication_method__should_indicate_an_error_and_not_retry_the_request_when_the_server_responds_with_a_token_error_and_there_is_no_way_to_renew_the_token()" time="0.1820380687713623">
        </testcase>
        <testcase classname="AuthTests" name="test__021__Token__authentication_method__should_transition_the_connection_to_the_FAILED_state_when_the_server_responds_with_a_token_error_and_there_is_no_way_to_renew_the_token()" time="2.733385920524597">
        </testcase>
        <testcase classname="AuthTests" name="test__022__Token__authentication_method__on_token_error__reissues_token_and_retries_REST_requests()" time="0.6360920667648315">
        </testcase>
        <testcase classname="AuthTests" name="test__023__Token__authentication_method__in_REST__if_the_token_creation_failed_or_the_subsequent_request_with_the_new_token_failed_due_to_a_token_error__then_the_request_should_result_in_an_error()" time="0.0031349658966064453">
        </testcase>
        <testcase classname="AuthTests" name="test__024__Token__authentication_method__in_Realtime__if_the_token_creation_failed_then_the_connection_should_move_to_the_DISCONNECTED_state_and_reports_the_error()" time="0.0177079439163208">
        </testcase>
        <testcase classname="AuthTests" name="test__025__Token__authentication_method__in_Realtime__if_the_connection_fails_due_to_a_terminal_token_error__then_the_connection_should_move_to_the_FAILED_state_and_reports_the_error()" time="0.5751180648803711">
        </testcase>
        <testcase classname="AuthTests" name="test__026__Token__authentication_method__if_a_request_by_a_realtime_client_to_an_authUrl_results_in_an_HTTP_403_the_client_library_should_transition_to_the_FAILED_state()" time="0.46376895904541016">
        </testcase>
        <testcase classname="AuthTests" name="test__027__Token__authentication_method__if_an_authCallback_results_in_an_HTTP_403_the_client_library_should_transition_to_the_FAILED_state()" time="0.0067909955978393555">
        </testcase>
        <testcase classname="AuthTests" name="test__028__Token__authentication_method__local_token_validity_check__should_be_done_if_queryTime_is_true_and_local_time_is_in_sync_with_server()" time="5.77646005153656">
        </testcase>
        <testcase classname="AuthTests" name="test__029__Token__authentication_method__local_token_validity_check__should_NOT_be_done_if_queryTime_is_false_and_local_time_is_NOT_in_sync_with_server()" time="5.793791055679321">
        </testcase>
        <testcase classname="AuthTests" name="test__030__Token__options__should_stop_client_when_useTokenAuth_and_no_key_occurs()" time="0.0014600753784179688">
        </testcase>
        <testcase classname="AuthTests" name="test__031__Token__options__should_stop_client_when_authCallback_and_authUrl_occurs()" time="0.0011210441589355469">
        </testcase>
        <testcase classname="AuthTests" name="test__032__Token__options__if_an_attempt_by_the_realtime_client_library_to_authenticate_is_made_using_the_authUrl_or_authCallback__the_request_to_authUrl_fails__if_the_connection_is_CONNECTING__then_the_connection_attempt_should_be_treated_as_unsuccessful()" time="0.26916706562042236">
        </testcase>
        <testcase classname="AuthTests" name="test__033__Token__options__if_an_attempt_by_the_realtime_client_library_to_authenticate_is_made_using_the_authUrl_or_authCallback__the_request_to_authUrl_fails__if_the_connection_is_CONNECTED__then_the_connection_should_remain_CONNECTED()" time="0.9047439098358154">
        </testcase>
        <testcase classname="AuthTests" name="test__034__Token__options__if_an_attempt_by_the_realtime_client_library_to_authenticate_is_made_using_the_authUrl_or_authCallback__the_request_to_authCallback_fails__if_the_connection_is_CONNECTING__then_the_connection_attempt_should_be_treated_as_unsuccessful()" time="0.02108895778656006">
        </testcase>
        <testcase classname="AuthTests" name="test__035__Token__options__if_an_attempt_by_the_realtime_client_library_to_authenticate_is_made_using_the_authUrl_or_authCallback__the_request_to_authCallback_fails__if_the_connection_is_CONNECTED__then_the_connection_should_remain_CONNECTED()" time="0.5129119157791138">
        </testcase>
        <testcase classname="AuthTests" name="test__036__Token__options__if_an_attempt_by_the_realtime_client_library_to_authenticate_is_made_using_the_authUrl_or_authCallback__the_provided_token_is_in_an_invalid_format__if_the_connection_is_CONNECTING__then_the_connection_attempt_should_be_treated_as_unsuccessful()" time="0.27152490615844727">
        </testcase>
        <testcase classname="AuthTests" name="test__037__Token__options__if_an_attempt_by_the_realtime_client_library_to_authenticate_is_made_using_the_authUrl_or_authCallback__the_provided_token_is_in_an_invalid_format__if_the_connection_is_CONNECTED__then_the_connection_should_remain_CONNECTED()" time="0.8934530019760132">
        </testcase>
        <testcase classname="AuthTests" name="test__038__Token__options__if_an_attempt_by_the_realtime_client_library_to_authenticate_is_made_using_the_authUrl_or_authCallback__the_attempt_times_out_after_realtimeRequestTimeout__if_the_connection_is_CONNECTING__then_the_connection_attempt_should_be_treated_as_unsuccessful()" time="0.515347957611084">
        </testcase>
        <testcase classname="AuthTests" name="test__039__Token__options__if_an_attempt_by_the_realtime_client_library_to_authenticate_is_made_using_the_authUrl_or_authCallback__the_attempt_times_out_after_realtimeRequestTimeout__if_the_connection_is_CONNECTED__then_the_connection_should_remain_CONNECTED()" time="1.9699079990386963">
        </testcase>
        <testcase classname="AuthTests" name="test__040__Token__token_auth_and_clientId__should_permit_to_be_unauthenticated()" time="0.36281096935272217">
        </testcase>
        <testcase classname="AuthTests" name="test__041__Token__token_auth_and_clientId__should_check_clientId_consistency__on_rest()" time="0.1910109519958496">
        </testcase>
        <testcase classname="AuthTests" name="test__042__Token__token_auth_and_clientId__should_check_clientId_consistency__on_realtime()" time="0.4355210065841675">
        </testcase>
        <testcase classname="AuthTests" name="test__043__Token__token_auth_and_clientId__should_check_clientId_consistency__with_wildcard()" time="0.0016220808029174805">
        </testcase>
        <testcase classname="AuthTests" name="test__044__Token__token_auth_and_clientId__Incompatible_client__with_Realtime__it_should_change_the_connection_state_to_FAILED_and_emit_an_error()" time="0.4638279676437378">
        </testcase>
        <testcase classname="AuthTests" name="test__045__Token__token_auth_and_clientId__Incompatible_client__with_Rest__it_should_result_in_an_appropriate_error_response()" time="0.18784093856811523">
        </testcase>
        <testcase classname="AuthTests" name="test__046__Token__clientId_and_authenticated_clients__should_not_pass_clientId_with_published_message()" time="0.1960608959197998">
        </testcase>
        <testcase classname="AuthTests" name="test__047__Token__clientId_and_authenticated_clients__should_obtain_a_token_if_clientId_is_assigned()" time="0.282709002494812">
        </testcase>
        <testcase classname="AuthTests" name="test__048__Token__clientId_and_authenticated_clients__should_convenience_clientId_return_a_string()" time="0.0014770030975341797">
        </testcase>
        <testcase classname="AuthTests" name="test__049__Token__clientId_and_authenticated_clients__ClientOptions_clientId_takes_precendence_when_a_clientId_value_is_provided_in_both_ClientOptions_clientId_and_ClientOptions_defaultTokenParams()" time="0.51146399974823">
        </testcase>
        <testcase classname="AuthTests" name="test__050__Token__clientId_and_authenticated_clients__should_clientId_be_null_or_string()" time="0.0011680126190185547">
        </testcase>
        <testcase classname="AuthTests" name="test__051__Token__clientId_and_authenticated_clients__Auth_clientId_attribute_is_null__identity_should_be_anonymous_for_all_operations()" time="0.2831540107727051">
        </testcase>
        <testcase classname="AuthTests" name="test__052__Token__clientId_and_authenticated_clients__Auth_clientId_attribute_is_null__identity_may_change_and_become_identified()" time="0.4987969398498535">
        </testcase>
        <testcase classname="AuthTests" name="test__053__Token__clientId_and_authenticated_clients__auth_clientId_not_null__when_clientId_attribute_is_assigned_on_client_options()" time="0.000988006591796875">
        </testcase>
        <testcase classname="AuthTests" name="test__054__Token__clientId_and_authenticated_clients__auth_clientId_not_null__when_tokenRequest_or_tokenDetails_has_clientId_not_null_or_wildcard_string()" time="0.19906699657440186">
        </testcase>
        <testcase classname="AuthTests" name="test__055__Token__clientId_and_authenticated_clients__auth_clientId_not_null__should_CONNECTED_ProtocolMessages_contain_a_clientId()" time="0.49385499954223633">
        </testcase>
        <testcase classname="AuthTests" name="test__056__Token__clientId_and_authenticated_clients__auth_clientId_not_null__client_does_not_have_an_identity_when_a_wildcard_string_____is_present()" time="0.4770759344100952">
        </testcase>
        <testcase classname="AuthTests" name="test__057__requestToken__implicitly_creates_a_TokenRequest_and_requests_a_token()" time="0.19031798839569092">
        </testcase>
        <testcase classname="AuthTests" name="test__058__requestToken__ensure_the_message_published_does_not_have_a_clientId()" time="0.47467100620269775">
        </testcase>
        <testcase classname="AuthTests" name="test__059__requestToken__ensure_that_the_message_is_rejected()" time="0.3802710771560669">
        </testcase>
        <testcase classname="AuthTests" name="test__060__requestToken__ensure_the_message_published_with_a_wildcard_____does_not_have_a_clientId()" time="0.47134900093078613">
        </testcase>
        <testcase classname="AuthTests" name="test__061__requestToken__ensure_the_message_published_with_a_wildcard_____has_the_provided_clientId()" time="0.49270200729370117">
        </testcase>
        <testcase classname="AuthTests" name="test__062__requestToken__arguments__should_not_merge_with_the_configured_params_and_options_but_instead_replace_all_corresponding_values__even_when__null_()" time="0.37075507640838623">
        </testcase>
        <testcase classname="AuthTests" name="test__063__requestToken__arguments__should_use_configured_defaults_if_the_object_arguments_are_omitted()" time="0.46452999114990234">
        </testcase>
        <testcase classname="AuthTests" name="test__064__requestToken__authUrl__query_will_provide_a_token_string()" time="0.4729729890823364">
        </testcase>
        <testcase classname="AuthTests" name="test__065__requestToken__authUrl__query_will_provide_a_TokenDetails()" time="0.46744394302368164">
        </testcase>
        <testcase classname="AuthTests" name="test__066__requestToken__authUrl__query_will_provide_a_TokenRequest()" time="0.4632450342178345">
        </testcase>
        <testcase classname="AuthTests" name="test__067__requestToken__authUrl__TokenParams_should_take_precedence_over_any_configured_authParams_when_a_name_conflict_occurs()" time="0.03071892261505127">
        </testcase>
        <testcase classname="AuthTests" name="test__068__requestToken__authUrl__should_override_previously_configured_parameters()" time="0.001139998435974121">
        </testcase>
        <testcase classname="AuthTests" name="test__069__requestToken__authUrl__parameters__should_be_added_to_the_URL_when_auth_method_is_GET()" time="0.0025179386138916016">
        </testcase>
        <testcase classname="AuthTests" name="test__070__requestToken__authUrl__parameters__should_added_on_the_body_request_when_auth_method_is_POST()" time="0.0008560419082641602">
        </testcase>
        <testcase classname="AuthTests" name="test__071__requestToken__should_support_all_TokenParams__using_defaults()" time="0.19962704181671143">
        </testcase>
        <testcase classname="AuthTests" name="test__072__requestToken__should_support_all_TokenParams__overriding_defaults()" time="0.22203707695007324">
        </testcase>
        <testcase classname="AuthTests" name="test__073__requestToken__When_authCallback_option_is_set__it_will_invoke_the_callback__with_a_token_string()" time="0.006388068199157715">
        </testcase>
        <testcase classname="AuthTests" name="test__074__requestToken__When_authCallback_option_is_set__it_will_invoke_the_callback__with_a_TokenDetails()" time="0.039533019065856934">
        </testcase>
        <testcase classname="AuthTests" name="test__075__requestToken__When_authCallback_option_is_set__it_will_invoke_the_callback__with_a_TokenRequest()" time="0.1837780475616455">
        </testcase>
        <testcase classname="AuthTests" name="test__076__createTokenRequest__should_not_merge_with_the_configured_params_and_options_but_instead_replace_all_corresponding_values__even_when__null_()" time="0.34137892723083496">
        </testcase>
        <testcase classname="AuthTests" name="test__077__createTokenRequest__should_override_defaults_if_AuthOptions_provided()" time="0.31218504905700684">
        </testcase>
        <testcase classname="AuthTests" name="test__078__createTokenRequest__should_use_defaults_if_no_AuthOptions_is_provided()" time="0.3198150396347046">
        </testcase>
        <testcase classname="AuthTests" name="test__079__createTokenRequest__should_replace_defaults_if__nil__option_s_field_passed()" time="0.0016959905624389648">
        </testcase>
        <testcase classname="AuthTests" name="test__080__createTokenRequest__should_use_configured_defaults_if_the_object_arguments_are_omitted()" time="0.18302905559539795">
        </testcase>
        <testcase classname="AuthTests" name="test__081__createTokenRequest__should_create_and_sign_a_TokenRequest()" time="0.010509014129638672">
        </testcase>
        <testcase classname="AuthTests" name="test__082__createTokenRequest__should_support_AuthOptions()" time="0.0014110803604125977">
        </testcase>
        <testcase classname="AuthTests" name="test__083__createTokenRequest__should_generate_a_unique_16_plus_character_nonce_if_none_is_provided()" time="0.0013489723205566406">
        </testcase>
        <testcase classname="AuthTests" name="test__084__createTokenRequest__should_provide_capability_has_json_text()" time="0.001974940299987793">
        </testcase>
        <testcase classname="AuthTests" name="test__085__createTokenRequest__should_generate_a_valid_HMAC()" time="0.001230001449584961">
        </testcase>
        <testcase classname="AuthTests" name="test__086__createTokenRequest__should_respect_all_requirements()" time="0.2648310661315918">
        </testcase>
        <testcase classname="AuthTests" name="test__087__createTokenRequest__should_generate_a_timestamp__from_current_time_if_not_provided()" time="0.001331925392150879">
        </testcase>
        <testcase classname="AuthTests" name="test__088__createTokenRequest__should_generate_a_timestamp__will_retrieve_the_server_time_if_queryTime_is_true()" time="0.1867969036102295">
        </testcase>
        <testcase classname="AuthTests" name="test__089__createTokenRequest__TTL__should_be_optional()" time="0.003567934036254883">
        </testcase>
        <testcase classname="AuthTests" name="test__090__createTokenRequest__TTL__should_be_specified_in_milliseconds()" time="0.0020989179611206055">
        </testcase>
        <testcase classname="AuthTests" name="test__091__createTokenRequest__TTL__should_be_valid_to_request_a_token_for_24_hours()" time="0.2115110158920288">
        </testcase>
        <testcase classname="AuthTests" name="test__092__authorize__should_always_create_a_token()" time="0.49831700325012207">
        </testcase>
        <testcase classname="AuthTests" name="test__093__authorize__should_create_a_new_token_if_one_already_exist_and_ensure_Token_Auth_is_used_for_all_future_requests()" time="0.4575510025024414">
        </testcase>
        <testcase classname="AuthTests" name="test__094__authorize__should_create_a_token_immediately_and_ensures_Token_Auth_is_used_for_all_future_requests()" time="0.2939150333404541">
        </testcase>
        <testcase classname="AuthTests" name="test__095__authorize__should_supports_all_TokenParams_and_AuthOptions()" time="0.0036619901657104492">
        </testcase>
        <testcase classname="AuthTests" name="test__096__authorize__should_use_the_requestToken_implementation()" time="0.1925950050354004">
        </testcase>
        <testcase classname="AuthTests" name="test__097__authorize__should_return_TokenDetails_with_valid_token_metadata()" time="0.20412695407867432">
        </testcase>
        <testcase classname="AuthTests" name="test__098__authorize__should_use_the_configured_Auth_clientId__if_not_null__by_default()" time="0.3767639398574829">
        </testcase>
        <testcase classname="AuthTests" name="test__099__authorize__on_subsequent_authorisations__should_store_the_AuthOptions_with_authUrl()" time="0.6031869649887085">
        </testcase>
        <testcase classname="AuthTests" name="test__100__authorize__on_subsequent_authorisations__should_store_the_AuthOptions_with_authCallback()" time="0.002763032913208008">
        </testcase>
        <testcase classname="AuthTests" name="test__101__authorize__on_subsequent_authorisations__should_not_store_queryTime()" time="0.3486529588699341">
        </testcase>
        <testcase classname="AuthTests" name="test__102__authorize__on_subsequent_authorisations__should_store_the_TokenParams()" time="2.378745913505554">
        </testcase>
        <testcase classname="AuthTests" name="test__103__authorize__on_subsequent_authorisations__should_use_configured_defaults_if_the_object_arguments_are_omitted()" time="0.3817930221557617">
        </testcase>
        <testcase classname="AuthTests" name="test__104__authorize__should_adhere_to_all_requirements_relating_to__TokenParams()" time="0.1893310546875">
        </testcase>
        <testcase classname="AuthTests" name="test__105__authorize__should_adhere_to_all_requirements_relating_to__authCallback()" time="0.19375598430633545">
        </testcase>
        <testcase classname="AuthTests" name="test__106__authorize__should_adhere_to_all_requirements_relating_to__authUrl()" time="0.2720071077346802">
        </testcase>
        <testcase classname="AuthTests" name="test__107__authorize__should_adhere_to_all_requirements_relating_to__authUrl_with_json()" time="0.7701810598373413">
        </testcase>
        <testcase classname="AuthTests" name="test__108__authorize__should_adhere_to_all_requirements_relating_to__authUrl_returning_TokenRequest_decodes_TTL_as_expected()" time="0.45833706855773926">
        </testcase>
        <testcase classname="AuthTests" name="test__109__authorize__should_adhere_to_all_requirements_relating_to__authUrl_with_plain_text()" time="0.7315139770507812">
        </testcase>
        <testcase classname="AuthTests" name="test__110__authorize__when_TokenParams_and_AuthOptions_are_provided__should_supersede_configured_AuthOptions__using_key__even_if_arguments_objects_are_empty()" time="1.3332509994506836">
        </testcase>
        <testcase classname="AuthTests" name="test__111__authorize__when_TokenParams_and_AuthOptions_are_provided__should_supersede_configured_AuthOptions__using_authUrl__even_if_arguments_objects_are_empty()" time="0.8622599840164185">
        </testcase>
        <testcase classname="AuthTests" name="test__112__authorize__when_TokenParams_and_AuthOptions_are_provided__should_supersede_configured_AuthOptions__using_authCallback__even_if_arguments_objects_are_empty()" time="0.003404974937438965">
        </testcase>
        <testcase classname="AuthTests" name="test__113__authorize__when_TokenParams_and_AuthOptions_are_provided__should_supersede_configured_params_and_options_even_if_arguments_objects_are_empty()" time="0.5311880111694336">
        </testcase>
        <testcase classname="AuthTests" name="test__114__authorize__when_TokenParams_and_AuthOptions_are_provided__example__if_a_client_is_initialised_with_TokenParams_ttl_configured_with_a_custom_value__and_a_TokenParams_object_is_passed_in_as_an_argument_to__authorize_with_a_null_value_for_ttl__then_the_ttl_used_for_every_subsequent_authorization_will_be_null()" time="0.2573620080947876">
        </testcase>
        <testcase classname="AuthTests" name="test__115__authorize__server_time_offset__should_obtain_server_time_once_and_persist_the_offset_from_the_local_clock()" time="0.3584200143814087">
        </testcase>
        <testcase classname="AuthTests" name="test__116__authorize__server_time_offset__should_be_consistent_the_timestamp_request_with_the_server_time()" time="0.18961501121520996">
        </testcase>
        <testcase classname="AuthTests" name="test__117__authorize__server_time_offset__should_be_possible_by_lib_Client_to_discard_the_cached_local_clock_offset()" time="0.3362240791320801">
        </testcase>
        <testcase classname="AuthTests" name="test__118__authorize__server_time_offset__should_use_the_local_clock_offset_to_calculate_the_server_time()" time="0.0013109445571899414">
        </testcase>
        <testcase classname="AuthTests" name="test__119__authorize__server_time_offset__should_request_server_time_when_queryTime_is_true_even_if_the_time_offset_is_assigned()" time="0.27683496475219727">
        </testcase>
        <testcase classname="AuthTests" name="test__120__authorize__server_time_offset__should_discard_the_time_offset_in_situations_in_which_it_may_have_been_invalidated()" time="0.007104992866516113">
        </testcase>
        <testcase classname="AuthTests" name="test__121__authorize__two_consecutive_authorizations__using_REST__should_call_each_authorize_callback()" time="0.20651698112487793">
        </testcase>
        <testcase classname="AuthTests" name="test__122__authorize__two_consecutive_authorizations__using_Realtime_and_connection_is_CONNECTING__should_call_each_Realtime_authorize_callback()" time="0.7830469608306885">
        </testcase>
        <testcase classname="AuthTests" name="test__123__authorize__two_consecutive_authorizations__using_Realtime_and_connection_is_CONNECTED__should_call_each_Realtime_authorize_callback()" time="0.7026979923248291">
        </testcase>
        <testcase classname="AuthTests" name="test__124__TokenParams__timestamp__if_explicitly_set__should_be_returned_by_the_getter()" time="0.0009529590606689453">
        </testcase>
        <testcase classname="AuthTests" name="test__125__TokenParams__timestamp__if_explicitly_set__the_value_should_stick()" time="0.26172590255737305">
        </testcase>
        <testcase classname="AuthTests" name="test__126__TokenParams__timestamp__object_has_no_timestamp_value_unless_explicitly_set()" time="0.0005069971084594727">
        </testcase>
        <testcase classname="AuthTests" name="test__127__Reauth__should_use_authorize__force__true___to_reauth_with_a_token_with_a_different_set_of_capabilities()" time="1.0206890106201172">
        </testcase>
        <testcase classname="AuthTests" name="test__128__Reauth__for_a_token_change_that_fails_due_to_an_incompatible_token__which_should_result_in_the_connection_entering_the_FAILED_state()" time="0.5861189365386963">
        </testcase>
        <testcase classname="AuthTests" name="test__129__TokenParams__timestamp_should_not_be_a_member_of_any_default_token_params()" time="0.19092607498168945">
        </testcase>
        <testcase classname="AuthTests" name="test__130__TokenRequest__fromJson__rejects_invalid_JSON()" time="0.011910080909729004">
        </testcase>
        <testcase classname="AuthTests" name="test__131__TokenRequest__fromJson__rejects_non_object_JSON()" time="0.0005680322647094727">
        </testcase>
        <testcase classname="AuthTests" name="test__132__TokenRequest__fromJson__with_TTL__accepts_a_string__which_should_be_interpreted_as_JSON()" time="0.001350998878479004">
        </testcase>
        <testcase classname="AuthTests" name="test__133__TokenRequest__fromJson__with_TTL__accepts_a_NSDictionary()" time="0.0005480051040649414">
        </testcase>
        <testcase classname="AuthTests" name="test__134__TokenRequest__fromJson__without_TTL__accepts_a_string__which_should_be_interpreted_as_JSON()" time="0.0004119873046875">
        </testcase>
        <testcase classname="AuthTests" name="test__135__TokenRequest__fromJson__without_TTL__accepts_a_NSDictionary()" time="0.0004069805145263672">
        </testcase>
        <testcase classname="AuthTests" name="test__136__TokenDetails__fromJson__accepts_a_string__which_should_be_interpreted_as_JSON()" time="0.0005340576171875">
        </testcase>
        <testcase classname="AuthTests" name="test__137__TokenDetails__fromJson__accepts_a_NSDictionary()" time="0.0015770196914672852">
        </testcase>
        <testcase classname="AuthTests" name="test__138__TokenDetails__fromJson__rejects_invalid_JSON()" time="0.001260995864868164">
        </testcase>
        <testcase classname="AuthTests" name="test__139__TokenDetails__fromJson__rejects_non_object_JSON()" time="0.0019539594650268555">
        </testcase>
        <testcase classname="AuthTests" name="test__140__JWT_and_realtime__client_initialized_with_a_JWT_token_in_ClientOptions__with_valid_credentials__pulls_stats_successfully()" time="0.23156797885894775">
        </testcase>
        <testcase classname="AuthTests" name="test__141__JWT_and_realtime__client_initialized_with_a_JWT_token_in_ClientOptions__with_invalid_credentials__fails_to_connect_with_reason__invalid_signature_()" time="0.29885804653167725">
        </testcase>
        <testcase classname="AuthTests" name="test__142__JWT_and_realtime__when_using_authUrl__with_valid_credentials__fetches_a_channels_and_posts_a_message()" time="0.8192590475082397">
        </testcase>
        <testcase classname="AuthTests" name="test__143__JWT_and_realtime__when_using_authUrl__with_wrong_credentials__fails_to_connect_with_reason__invalid_signature_()" time="1.5438309907913208">
        </testcase>
        <testcase classname="AuthTests" name="test__144__JWT_and_realtime__when_using_authUrl__when_token_expires__receives_a_40142_error_from_the_server()" time="5.033728003501892">
        </testcase>
        <testcase classname="AuthTests" name="test__145__JWT_and_realtime__when_using_authUrl__when_the_server_sends_and_AUTH_protocol_message__client_reauths_correctly_without_going_through_a_disconnection()" time="5.196694016456604">
        </testcase>
        <testcase classname="AuthTests" name="test__146__JWT_and_realtime__when_using_authCallback__with_valid_credentials__pulls_stats_successfully()" time="0.2199629545211792">
        </testcase>
        <testcase classname="AuthTests" name="test__147__JWT_and_realtime__when_using_authCallback__with_invalid_credentials__fails_to_connect()" time="0.5877929925918579">
        </testcase>
        <testcase classname="AuthTests" name="test__148__JWT_and_realtime__when_token_expires_and_has_a_means_to_renew__reconnects_using_authCallback_and_obtains_a_new_token()" time="2.292794942855835">
        </testcase>
        <testcase classname="AuthTests" name="test__149__JWT_and_realtime__when_the_token_request_includes_a_clientId__the_clientId_is_the_same_specified_in_the_JWT_token_request()" time="0.29730701446533203">
        </testcase>
        <testcase classname="AuthTests" name="test__150__JWT_and_realtime__when_the_token_request_includes_subscribe_only_capabilities__fails_to_publish_to_a_channel_with_subscribe_only_capability()" time="0.35343801975250244">
        </testcase>
        <testcase classname="AuthTests" name="test__151__currentTokenDetails__should_hold_a__TokenDetails__instance_in_which_only_the__token__attribute_is_populated_with_that_token_string()" time="0.21219706535339355">
        </testcase>
        <testcase classname="AuthTests" name="test__152__currentTokenDetails__should_be_set_with_the_current_token__if_applicable__on_instantiation_and_each_time_it_is_replaced()" time="0.21973907947540283">
        </testcase>
        <testcase classname="AuthTests" name="test__153__currentTokenDetails__should_be_empty_if_there_is_no_current_token()" time="0.0019470453262329102">
        </testcase>
        <testcase classname="AuthTests" name="test__154__JWT_and_rest__when_the_JWT_token_embeds_an_Ably_token__pulls_stats_successfully()" time="0.7538150548934937">
        </testcase>
        <testcase classname="AuthTests" name="test__155__JWT_and_rest__when_the_JWT_token_embeds_an_Ably_token_and_it_is_requested_as_encrypted__pulls_stats_successfully()" time="0.7398629188537598">
        </testcase>
        <testcase classname="AuthTests" name="test__156__JWT_and_rest__when_the_JWT_token_is_returned_with_application_jwt_content_type__the_client_successfully_connects_and_pulls_stats()" time="0.6337850093841553">
        </testcase>
        <testcase classname="AuthTests" name="test__157__JWT_and_rest__when_the_JWT_token_is_returned_with_application_jwt_content_type__the_client_can_request_a_new_token_to_initilize_another_client_that_connects_and_pulls_stats()" time="0.6456489562988281">
        </testcase>
        <testcase classname="BackoffRetryDelayCalculatorTests" name="test_delay()" time="0.009503006935119629">
        </testcase>
        <testcase classname="ChannelOptionsTests" name="test_copyChannelOptions()" time="0.0316849946975708">
        </testcase>
        <testcase classname="ChannelOptionsTests" name="test_copyingFrozenChannelOptions_createsUnfrozenCopy()" time="0.0005450248718261719">
        </testcase>
        <testcase classname="ChannelOptionsTests" name="test_copyingFrozenRealtimeChannelOptions_createsUnfrozenCopy()" time="0.0005199909210205078">
        </testcase>
        <testcase classname="ChannelOptionsTests" name="test_copyRealtimeChannelOptions()" time="0.0008230209350585938">
        </testcase>
        <testcase classname="ClientInformationTests" name="testAgentIdentifierWithAdditionalAgents_withNilAdditionalAgents()" time="0.0022519826889038086">
        </testcase>
        <testcase classname="ClientInformationTests" name="testAgentIdentifierWithAdditionalAgents_withNonNilAdditionalAgents()" time="0.0021070241928100586">
        </testcase>
        <testcase classname="ClientInformationTests" name="testAgents()" time="0.0020279884338378906">
        </testcase>
        <testcase classname="ConnectRetryStateTests" name="test_addRetryAttempt()" time="0.007966995239257812">
        </testcase>
        <testcase classname="ConnectRetryStateTests" name="test_transitionToConnectingOrDisconnectedStateDoesNotResetRetrySequence()" time="0.0014990568161010742">
        </testcase>
        <testcase classname="ConnectRetryStateTests" name="test_transitionToNonConnectingOrDisconnectedStateResetsRetrySequence()" time="0.0006099939346313477">
        </testcase>
        <testcase classname="CryptoTests" name="test__001__Crypto__getDefaultParams__returns_a_complete_CipherParams_instance__using_the_default_values_for_any_field_not_supplied()" time="0.006121039390563965">
        </testcase>
        <testcase classname="CryptoTests" name="test__002__Crypto__getDefaultParams__calculates_a_keyLength_from_the_key__its_size_in_bits_()" time="0.0005300045013427734">
        </testcase>
        <testcase classname="CryptoTests" name="test__003__Crypto__getDefaultParams__should_check_that_keyLength_is_valid_for_algorithm()" time="0.0005168914794921875">
        </testcase>
        <testcase classname="CryptoTests" name="test__004__Crypto__getDefaultParams__key_parameter__can_be_a_binary()" time="0.0006320476531982422">
        </testcase>
        <testcase classname="CryptoTests" name="test__005__Crypto__getDefaultParams__key_parameter__can_be_a_base64_encoded_string_with_standard_encoding()" time="0.0013860464096069336">
        </testcase>
        <testcase classname="CryptoTests" name="test__006__Crypto__getDefaultParams__key_parameter__can_be_a_base64_encoded_string_with_URL_encoding()" time="0.0007369518280029297">
        </testcase>
        <testcase classname="CryptoTests" name="test__007__Crypto__generateRandomKey__takes_a_single_length_argument_and_returns_a_binary()" time="0.0015320777893066406">
        </testcase>
        <testcase classname="CryptoTests" name="test__008__Crypto__generateRandomKey__takes_no_arguments_and_returns_the_default_algorithm_s_default_length()" time="0.001661062240600586">
        </testcase>
        <testcase classname="CryptoTests" name="test__009__Crypto__generateHashSHA256__takes_data_and_returns_a_SHA256_digest()" time="0.0018409490585327148">
        </testcase>
        <testcase classname="CryptoTests" name="test__010__Crypto__encrypt__should_generate_a_new_IV_every_time_it_s_called__and_should_be_the_first_block_encrypted()" time="0.0033179521560668945">
        </testcase>
        <testcase classname="CryptoTests" name="test__011__Crypto__with_fixtures_from_crypto_data_128_json__should_encrypt_messages_as_expected_in_the_fixtures()" time="0.010482072830200195">
        </testcase>
        <testcase classname="CryptoTests" name="test__012__Crypto__with_fixtures_from_crypto_data_128_json__should_decrypt_messages_as_expected_in_the_fixtures()" time="0.0013300180435180664">
        </testcase>
        <testcase classname="CryptoTests" name="test__013__Crypto__with_fixtures_from_crypto_data_256_json__should_encrypt_messages_as_expected_in_the_fixtures()" time="0.006181001663208008">
        </testcase>
        <testcase classname="CryptoTests" name="test__014__Crypto__with_fixtures_from_crypto_data_256_json__should_decrypt_messages_as_expected_in_the_fixtures()" time="0.012892961502075195">
        </testcase>
        <testcase classname="CryptoTests" name="test__015__Crypto__with_fixtures_from_crypto_data_128_json__manual_decrypt_messages_as_expected_in_the_fixtures()" time="0.0025190114974975586">
        </testcase>
        <testcase classname="CryptoTests" name="test__016__Crypto__with_fixtures_from_crypto_data_256_json__manual_decrypt_messages_as_expected_in_the_fixtures()" time="0.011516094207763672">
        </testcase>
        <testcase classname="DefaultErrorCheckerTests" name="test_isTokenError_statusCode401AndCodeBetween40140And40150()" time="0.0015649795532226562">
        </testcase>
        <testcase classname="DefaultErrorCheckerTests" name="test_isTokenError_statusCode401ButCodeGreaterThanOrEqualTo40150()" time="0.0014879703521728516">
        </testcase>
        <testcase classname="DefaultErrorCheckerTests" name="test_isTokenError_statusCode401ButCodeLessThan40140()" time="0.0006378889083862305">
        </testcase>
        <testcase classname="DefaultErrorCheckerTests" name="test_isTokenError_statusCodeNot401()" time="0.0005509853363037109">
        </testcase>
        <testcase classname="DefaultInternalLogCoreTests" name="test_initWithClientOptions_whenClientOptionsLogLevelIsNone()" time="0.0010720491409301758">
        </testcase>
        <testcase classname="DefaultInternalLogCoreTests" name="test_initWithClientOptions_whenClientOptionsLogLevelIsNotNone()" time="0.0030390024185180664">
        </testcase>
        <testcase classname="DefaultInternalLogCoreTests" name="test_logLevel()" time="0.0023499727249145508">
        </testcase>
        <testcase classname="DefaultInternalLogCoreTests" name="test_logMessage()" time="0.00214993953704834">
        </testcase>
        <testcase classname="DefaultInternalLogCoreTests" name="test_setLogLevel()" time="0.0021560192108154297">
        </testcase>
        <testcase classname="DefaultJitterCoefficientGeneratorTests" name="test_generatesAVarietyOfValues()" time="0.04359996318817139">
        </testcase>
        <testcase classname="DefaultJitterCoefficientGeneratorTests" name="test_generatesValuesInExpectedRange()" time="0.001459956169128418">
        </testcase>
        <testcase classname="DeltaCodecTests" name="test__001__withBinaryProtocol_DeltaCodec__decoding__should_decode_vcdiff_encoded_messages()" time="4.94848096370697">
        </testcase>
        <testcase classname="DeltaCodecTests" name="test__001__withoutBinaryProtocol_DeltaCodec__decoding__should_decode_vcdiff_encoded_messages()" time="4.967022061347961">
        </testcase>
        <testcase classname="DeltaCodecTests" name="test__002__DeltaCodec__decoding__should_fail_and_recover_when_the_vcdiff_messages_are_out_of_order()" time="0.5492019653320312">
        </testcase>
        <testcase classname="DeltaCodecTests" name="test__003__DeltaCodec__decoding__should_recover_when_the_vcdiff_message_decoding_fails()" time="0.5639081001281738">
        </testcase>
        <testcase classname="HttpAnnotationsTests" name="test__annotation_data_uses_a_cipher_added_by_setOptions_after_channel_creation()" time="0.6502120494842529">
        </testcase>
        <testcase classname="HttpAnnotationsTests" name="test__idempotent_publishing_should_publish_annotation_with_implicit_id_only_once()" time="2.87738299369812">
        </testcase>
        <testcase classname="HttpAnnotationsTests" name="test__publish_annotation_exceeding_max_message_size()" time="0.0022079944610595703">
        </testcase>
        <testcase classname="HttpAnnotationsTests" name="test__publish_delete_and_get_annotations()" time="2.826915979385376">
        </testcase>
        <testcase classname="HttpClientChannelTests" name="test__001__publish__should_not_fail_sending_a_message_with_no_clientId_in_the_client_options_and_credentials_that_can_assume_any_clientId()" time="0.4838700294494629">
        </testcase>
        <testcase classname="HttpClientChannelTests" name="test__002__publish__should_provide_an_optional_argument_that_allows_the_clientId_value_to_be_specified()" time="0.0018880367279052734">
        </testcase>
        <testcase classname="HttpClientChannelTests" name="test__003__publish__should_provide_an_optional_argument_that_allows_the_extras_value_to_be_specified()" time="0.31654489040374756">
        </testcase>
        <testcase classname="HttpClientChannelTests" name="test__004__publish__should_include_attributes_supplied_by_the_caller_in_the_encoded_message()" time="0.18793106079101562">
        </testcase>
        <testcase classname="HttpClientChannelTests" name="test__005__publish__with_name_and_data_arguments__publishes_the_message_and_invokes_callback_with_success()" time="0.32449305057525635">
        </testcase>
        <testcase classname="HttpClientChannelTests" name="test__006__publish__with_name_only__publishes_the_message_and_invokes_callback_with_success()" time="0.3047189712524414">
        </testcase>
        <testcase classname="HttpClientChannelTests" name="test__007__publish__with_data_only__publishes_the_message_and_invokes_callback_with_success()" time="0.27673304080963135">
        </testcase>
        <testcase classname="HttpClientChannelTests" name="test__008__publish__with_neither_name_nor_data__publishes_the_message_and_invokes_callback_with_success()" time="0.28395891189575195">
        </testcase>
        <testcase classname="HttpClientChannelTests" name="test__009__publish__with_a_Message_object__publishes_the_message_and_invokes_callback_with_success()" time="0.297605037689209">
        </testcase>
        <testcase classname="HttpClientChannelTests" name="test__010__publish__with_an_array_of_Message_objects__publishes_the_messages_in_a_single_request_and_invokes_callback_with_success()" time="0.39352500438690186">
        </testcase>
        <testcase classname="HttpClientChannelTests" name="test__011__publish__Unidentified_clients_using_Basic_Auth__should_publish_message_with_the_provided_clientId()" time="0.27541589736938477">
        </testcase>
        <testcase classname="HttpClientChannelTests" name="test__012__publish__ClientOptions_clientId__should_include_the_clientId_as_a_querystring_parameter_in_realtime_connection_requests()" time="0.3616499900817871">
        </testcase>
        <testcase classname="HttpClientChannelTests" name="test__013__publish__ClientOptions_clientId__should_include_an_X_Ably_ClientId_header_with_value_set_to_the_clientId_as_Base64_encoded_string_in_REST_connection_requests()" time="0.2244579792022705">
        </testcase>
        <testcase classname="HttpClientChannelTests" name="test__014__publish__Message_clientId__publishing_with_no_clientId_when_the_clientId_is_set_to_some_value_in_the_client_options_should_result_in_a_message_received_with_the_clientId_property_set_to_that_value()" time="0.5768629312515259">
        </testcase>
        <testcase classname="HttpClientChannelTests" name="test__015__publish__Message_clientId__publishing_with_a_clientId_set_to_the_same_value_as_the_clientId_in_the_client_options_should_result_in_a_message_received_with_the_clientId_property_set_to_that_value()" time="0.9731800556182861">
        </testcase>
        <testcase classname="HttpClientChannelTests" name="test__016__publish__Message_clientId__publishing_with_a_clientId_set_to_a_value_from_an_unidentified_client_should_result_in_a_message_received_with_the_clientId_property_set_to_that_value()" time="0.5760949850082397">
        </testcase>
        <testcase classname="HttpClientChannelTests" name="test__017__publish__Message_clientId__publishing_with_a_clientId_set_to_a_different_value_from_the_clientId_in_the_client_options_should_result_in_a_message_being_rejected_by_the_server()" time="0.37969696521759033">
        </testcase>
        <testcase classname="HttpClientChannelTests" name="test__018__publish__If_the_total_size_of_message_s__exceeds_the_maxMessageSize__the_client_library_should_reject_the_publish_and_indicate_an_error()" time="0.010035037994384766">
        </testcase>
        <testcase classname="HttpClientChannelTests" name="test__019__publish__If_the_total_size_of_message_s__exceeds_the_maxMessageSize__also_when_using_publish_data_clientId_extras()" time="0.0048770904541015625">
        </testcase>
        <testcase classname="HttpClientChannelTests" name="test__020__publish__idempotent_publishing__idempotentRestPublishing_option()" time="0.005359053611755371">
        </testcase>
        <testcase classname="HttpClientChannelTests" name="test__021__publish__idempotent_publishing__should_not_generate_for_message_with_a_non_empty_id()" time="0.0042809247970581055">
        </testcase>
        <testcase classname="HttpClientChannelTests" name="test__022__publish__idempotent_publishing__should_generate_for_internal_message_that_is_created_in_publish_name_data___method()" time="0.013110995292663574">
        </testcase>
        <testcase classname="HttpClientChannelTests" name="test__023__publish__idempotent_publishing__should_not_generate_for_multiple_messages_with_a_non_empty_id()" time="0.0017549991607666016">
        </testcase>
        <testcase classname="HttpClientChannelTests" name="test__024__publish__idempotent_publishing__should_not_generate_when_idempotentRestPublishing_flag_is_off()" time="0.0015619993209838867">
        </testcase>
        <testcase classname="HttpClientChannelTests" name="test__025__publish__idempotent_publishing__should_have_only_one_published_message()" time="0.8599148988723755">
        </testcase>
        <testcase classname="HttpClientChannelTests" name="test__026__publish__idempotent_publishing__should_publish_a_message_with_implicit_Id_only_once()" time="0.5474220514297485">
        </testcase>
        <testcase classname="HttpClientChannelTests" name="test__027__publish__idempotent_publishing__random_idempotent_publish_id__should_generate_for_one_message_with_empty_id()" time="0.005299091339111328">
        </testcase>
        <testcase classname="HttpClientChannelTests" name="test__028__publish__idempotent_publishing__random_idempotent_publish_id__should_generate_for_multiple_messages_with_empty_id()" time="0.0064040422439575195">
        </testcase>
        <testcase classname="HttpClientChannelTests" name="test__029__history__should_return_a_PaginatedResult_page_containing_the_first_page_of_messages()" time="0.2053389549255371">
        </testcase>
        <testcase classname="HttpClientChannelTests" name="test__030__history__query_arguments__start_and_end_should_filter_messages_between_those_two_times()" time="0.7262580394744873">
        </testcase>
        <testcase classname="HttpClientChannelTests" name="test__031__history__query_arguments__start_must_be_equal_to_or_less_than_end_and_is_unaffected_by_the_request_direction()" time="0.0030499696731567383">
        </testcase>
        <testcase classname="HttpClientChannelTests" name="test__032__history__query_arguments__direction_backwards_or_forwards()" time="0.29826998710632324">
        </testcase>
        <testcase classname="HttpClientChannelTests" name="test__033__history__query_arguments__limit_items_result()" time="0.2714930772781372">
        </testcase>
        <testcase classname="HttpClientChannelTests" name="test__034__history__query_arguments__limit_supports_up_to_1000_items()" time="0.001703023910522461">
        </testcase>
        <testcase classname="HttpClientChannelTests" name="test__035__presence__get__should_return_presence_fixture_data()" time="2.137592077255249">
        </testcase>
        <testcase classname="HttpClientChannelTests" name="test__036__message_encoding__payloads_should_be_binary__strings__or_objects_capable_of_JSON_representation()" time="0.7223790884017944">
        </testcase>
        <testcase classname="HttpClientChannelTests" name="test__037__message_encoding__encoding_attribute_should_represent_the_encoding_s__applied_in_right_to_left()" time="0.4158029556274414">
        </testcase>
        <testcase classname="HttpClientChannelTests" name="test__038__message_encoding__json__binary_payload_should_be_encoded_as_Base64_and_represented_as_a_JSON_string()" time="0.25885605812072754">
        </testcase>
        <testcase classname="HttpClientChannelTests" name="test__039__message_encoding__json__string_payload_should_be_represented_as_a_JSON_string()" time="0.20670807361602783">
        </testcase>
        <testcase classname="HttpClientChannelTests" name="test__040__message_encoding__json__messages_received_should_be_decoded_based_on_the_encoding_field()" time="0.6594079732894897">
        </testcase>
        <testcase classname="HttpClientChannelTests" name="test__041__message_encoding__json__json_payload_should_be_stringified_either__as_a_JSON_Array()" time="0.20750796794891357">
        </testcase>
        <testcase classname="HttpClientChannelTests" name="test__042__message_encoding__json__json_payload_should_be_stringified_either__as_a_JSON_Object()" time="0.2210320234298706">
        </testcase>
        <testcase classname="HttpClientChannelTests" name="test__043__message_payload_encryption__should_support_AES_encryption__128_CBC_mode()" time="0.3409219980239868">
        </testcase>
        <testcase classname="HttpClientChannelTests" name="test__044__message_payload_encryption__should_support_AES_encryption__256_CBC_mode()" time="0.29657208919525146">
        </testcase>
        <testcase classname="HttpClientChannelTests" name="test__045__message_decoding__should_deliver_with_a_binary_payload_when_the_payload_was_successfully_decoded_but_it_could_not_be_decrypted()" time="0.4475250244140625">
        </testcase>
        <testcase classname="HttpClientChannelTests" name="test__046__message_decoding__should_deliver_with_encoding_attribute_set_indicating_the_residual_encoding_and_error_should_be_emitted()" time="0.2784539461135864">
        </testcase>
        <testcase classname="HttpClientChannelTests" name="test__047__status__with_subscribers__returns_a_channel_details_object_populated_with_channel_metrics()" time="0.6606720685958862">
        </testcase>
        <testcase classname="HttpClientChannelTests" name="test__48__channel_name_can_contain_slash_character_which_is_url_encoded_in_the_rest_request_path()" time="0.004130005836486816">
        </testcase>
        <testcase classname="HttpClientChannelTests" name="test__49__publish__with_resultCallback__returns_valid_PublishResult_with_message_serials()" time="0.21329903602600098">
        </testcase>
        <testcase classname="HttpClientChannelsTests" name="test__001__RestClient__channels__should_return_collection_of_channels()" time="0.006088972091674805">
        </testcase>
        <testcase classname="HttpClientChannelsTests" name="test__002__RestClient__channels__should_be_enumerable()" time="0.005234956741333008">
        </testcase>
        <testcase classname="HttpClientChannelsTests" name="test__003__RestClient__channels__get__should_return_a_channel()" time="0.0037039518356323242">
        </testcase>
        <testcase classname="HttpClientChannelsTests" name="test__004__RestClient__channels__get__should_return_a_channel_with_the_provided_options()" time="0.0011650323867797852">
        </testcase>
        <testcase classname="HttpClientChannelsTests" name="test__005__RestClient__channels__get__should_not_replace_the_options_on_an_existing_channel_when_none_are_provided()" time="0.001565098762512207">
        </testcase>
        <testcase classname="HttpClientChannelsTests" name="test__006__RestClient__channels__get__should_replace_the_options_on_an_existing_channel_when_new_ones_are_provided()" time="0.0014840364456176758">
        </testcase>
        <testcase classname="HttpClientChannelsTests" name="test__007__RestClient__channels__channelExists__should_check_if_a_channel_exists()" time="0.0015660524368286133">
        </testcase>
        <testcase classname="HttpClientChannelsTests" name="test__008__RestClient__channels__releaseChannel__should_release_a_channel()" time="0.0006749629974365234">
        </testcase>
        <testcase classname="HttpClientPresenceTests" name="test__001__Presence__presence_messages_retrieved_are_decoded_in_the_same_way_that_messages_are_decoded()" time="0.872473955154419">
        </testcase>
        <testcase classname="HttpClientPresenceTests" name="test__002__Presence__get__should_return_a_PaginatedResult_page_containing_the_first_page_of_members()" time="75.32389903068542">
        </testcase>
        <testcase classname="HttpClientPresenceTests" name="test__003__Presence__get__limit_should_support_up_to_1000_items()" time="0.004500031471252441">
        </testcase>
        <testcase classname="HttpClientPresenceTests" name="test__004__Presence__get__clientId_should_filter_members_by_the_provided_clientId()" time="0.7064820528030396">
        </testcase>
        <testcase classname="HttpClientPresenceTests" name="test__005__Presence__get__connectionId_should_filter_members_by_the_provided_connectionId()" time="4.675312042236328">
        </testcase>
        <testcase classname="HttpClientPresenceTests" name="test__006__Presence__history__should_return_a_PaginatedResult_page_containing_the_first_page_of_members()" time="75.32946598529816">
        </testcase>
        <testcase classname="HttpClientPresenceTests" name="test__007__Presence__history__query_argument__direction_should_change_the_order_of_the_members()" time="5.278789043426514">
        </testcase>
        <testcase classname="HttpClientPresenceTests" name="test__008__Presence__history__connectionId_should_filter_members_by_the_provided_connectionId()" time="4.593930959701538">
        </testcase>
        <testcase classname="HttpClientPresenceTests" name="test__009__Presence__history__query_argument__limit_supports_up_to_1000_members()" time="0.6494280099868774">
        </testcase>
        <testcase classname="HttpClientPresenceTests" name="test__010__Presence__history__query_argument__start_and_end_should_filter_members_between_those_two_times()" time="20.822438955307007">
        </testcase>
        <testcase classname="HttpClientPresenceTests" name="test__011__Presence__history__query_argument__start_must_be_equal_to_or_less_than_end_and_is_unaffected_by_the_request_direction()" time="0.001963019371032715">
        </testcase>
        <testcase classname="HttpClientStatsTests" name="test__001__RestClient__stats__result__should_match_minute_level_inbound_and_outbound_fixture_data__forwards_()" time="2.943279981613159">
        </testcase>
        <testcase classname="HttpClientStatsTests" name="test__002__RestClient__stats__result__should_match_hour_level_inbound_and_outbound_fixture_data__forwards_()" time="2.6000770330429077">
        </testcase>
        <testcase classname="HttpClientStatsTests" name="test__003__RestClient__stats__result__should_match_day_level_inbound_and_outbound_fixture_data__forwards_()" time="2.3707990646362305">
        </testcase>
        <testcase classname="HttpClientStatsTests" name="test__004__RestClient__stats__result__should_match_month_level_inbound_and_outbound_fixture_data__forwards_()" time="2.7424910068511963">
        </testcase>
        <testcase classname="HttpClientStatsTests" name="test__005__RestClient__stats__result__should_contain_only_one_item_when_limit_is_1__backwards()" time="2.727450966835022">
        </testcase>
        <testcase classname="HttpClientStatsTests" name="test__006__RestClient__stats__result__should_contain_only_one_item_when_limit_is_1__forwards()" time="2.6993370056152344">
        </testcase>
        <testcase classname="HttpClientStatsTests" name="test__007__RestClient__stats__result__should_be_paginated_according_to_the_limit__backwards()" time="2.4835389852523804">
        </testcase>
        <testcase classname="HttpClientStatsTests" name="test__008__RestClient__stats__result__should_be_paginated_according_to_the_limit__fowards_()" time="3.020676016807556">
        </testcase>
        <testcase classname="HttpClientStatsTests" name="test__009__RestClient__stats__query__start__should_raise_when_later_than_end()" time="0.0038170814514160156">
        </testcase>
        <testcase classname="HttpClientStatsTests" name="test__010__RestClient__stats__query__direction__should_be_backwards_by_default()" time="0.0008169412612915039">
        </testcase>
        <testcase classname="HttpClientStatsTests" name="test__011__RestClient__stats__query__limit__should_have_a_default_value_of_100()" time="0.000677943229675293">
        </testcase>
        <testcase classname="HttpClientStatsTests" name="test__012__RestClient__stats__query__limit__should_raise_when_greater_than_1000()" time="0.0007190704345703125">
        </testcase>
        <testcase classname="HttpClientStatsTests" name="test__013__RestClient__stats__query__unit__should_default_to_minute()" time="0.0004590749740600586">
        </testcase>
        <testcase classname="HttpClientStatsTests" name="test__014__RestClient__stats__query__start__should_not_raise_when_end_is_not_set()" time="0.006966948509216309">
        </testcase>
        <testcase classname="HttpClientTests" name="test__001__RestClient__All_REST_requests_should_include_the_current_API_version()" time="0.22972404956817627">
        </testcase>
        <testcase classname="HttpClientTests" name="test__002__RestClient__should_provide_access_to_the_AuthOptions_object_passed_in_ClientOptions()" time="0.002909064292907715">
        </testcase>
        <testcase classname="HttpClientTests" name="test__003__RestClient__REST_endpoint_host_should_be_configurable_in_the_Client_constructor_with_the_option_endpoint()" time="0.03660297393798828">
        </testcase>
        <testcase classname="HttpClientTests" name="test__004__RestClient__should_send_requests_over_http_and_https()" time="0.479949951171875">
        </testcase>
        <testcase classname="HttpClientTests" name="test__005__RestClient__should_use_Auth_to_manage_authentication()" time="0.22588002681732178">
        </testcase>
        <testcase classname="HttpClientTests" name="test__006__RestClient__should_request_another_token_after_current_one_is_no_longer_valid()" time="1.7308659553527832">
        </testcase>
        <testcase classname="HttpClientTests" name="test__007__RestClient__should_result_in_an_error_when_user_does_not_have_sufficient_permissions()" time="0.3918590545654297">
        </testcase>
        <testcase classname="HttpClientTests" name="test__008__RestClient__should_use_MsgPack_binary_protocol()" time="0.5721269845962524">
        </testcase>
        <testcase classname="HttpClientTests" name="test__009__RestClient__should_use_JSON_text_protocol()" time="0.5783460140228271">
        </testcase>
        <testcase classname="HttpClientTests" name="test__010__RestClient__X_Ably_Version_must_be_included_in_all_REST_requests()" time="0.25555098056793213">
        </testcase>
        <testcase classname="HttpClientTests" name="test__011__RestClient__The_Agent_library_identifier_is_composed_of_a_series_of_key__value__entries_joined_by_spaces()" time="0.1899939775466919">
        </testcase>
        <testcase classname="HttpClientTests" name="test__012__RestClient__should_indicate_an_error_if_there_is_no_way_to_renew_the_token()" time="2.637257933616638">
        </testcase>
        <testcase classname="HttpClientTests" name="test__013__RestClient__background_behaviour()" time="1.2345339059829712">
        </testcase>
        <testcase classname="HttpClientTests" name="test__014__RestClient__client_should_handle_error_messages_in_plaintext_and_HTML_format()" time="0.06561994552612305">
        </testcase>
        <testcase classname="HttpClientTests" name="test__015__RestClient__initializer__should_accept_an_API_key()" time="0.0032989978790283203">
        </testcase>
        <testcase classname="HttpClientTests" name="test__016__RestClient__initializer__should_throw_when_provided_an_invalid_key()" time="0.0007429122924804688">
        </testcase>
        <testcase classname="HttpClientTests" name="test__017__RestClient__initializer__should_result_in_error_status_when_provided_a_bad_key()" time="0.2063359022140503">
        </testcase>
        <testcase classname="HttpClientTests" name="test__018__RestClient__initializer__should_accept_a_token()" time="0.19407308101654053">
        </testcase>
        <testcase classname="HttpClientTests" name="test__019__RestClient__initializer__should_accept_an_options_object()" time="0.0019540786743164062">
        </testcase>
        <testcase classname="HttpClientTests" name="test__020__RestClient__initializer__should_accept_an_options_object_with_token_authentication()" time="0.2601139545440674">
        </testcase>
        <testcase classname="HttpClientTests" name="test__021__RestClient__initializer__should_result_in_error_status_when_provided_a_bad_token()" time="0.20406889915466309">
        </testcase>
        <testcase classname="HttpClientTests" name="test__022__RestClient__logging__should_output_to_the_system-log_and_the_log_level_should_be_Warn()" time="0.0013990402221679688">
        </testcase>
        <testcase classname="HttpClientTests" name="test__023__RestClient__logging__should_have_a_mutable_log_level()" time="0.009690046310424805">
        </testcase>
        <testcase classname="HttpClientTests" name="test__024__RestClient__logging__should_accept_a_custom_logger()" time="0.002515077590942383">
        </testcase>
        <testcase classname="HttpClientTests" name="test__025__RestClient__endpoint__should_accept_a_custom_host_and_send_requests_to_the_specified_host()" time="0.013917088508605957">
        </testcase>
        <testcase classname="HttpClientTests" name="test__026__RestClient__endpoint__should_send_requests_to_the_production_routing_policy_host()" time="0.014137029647827148">
        </testcase>
        <testcase classname="HttpClientTests" name="test__027__RestClient__endpoint__should_send_requests_to_the_nonprod_routing_policy_host()" time="0.005236029624938965">
        </testcase>
        <testcase classname="HttpClientTests" name="test__028__RestClient__endpoint__should_default_to_https___main_realtime_ably_net()" time="0.05206406116485596">
        </testcase>
        <testcase classname="HttpClientTests" name="test__028a__RestClient__endpoint__an_empty_endpoint_means_the_default()" time="0.031669020652770996">
        </testcase>
        <testcase classname="HttpClientTests" name="test__029__RestClient__endpoint__should_connect_over_plain_http____when_tls_is_off()" time="0.22757494449615479">
        </testcase>
        <testcase classname="HttpClientTests" name="test__031__RestClient__should_use_the_the_connection_and_request_timeouts_specified__timeout_for_any_single_HTTP_request_and_response()" time="1.034567952156067">
        </testcase>
        <testcase classname="HttpClientTests" name="test__032__RestClient__should_use_the_the_connection_and_request_timeouts_specified__max_number_of_fallback_hosts()" time="0.0052928924560546875">
        </testcase>
        <testcase classname="HttpClientTests" name="test__033__RestClient__should_use_the_the_connection_and_request_timeouts_specified__max_elapsed_time_in_which_fallback_host_retries_for_HTTP_requests_will_be_attempted()" time="0.48455798625946045">
        </testcase>
        <testcase classname="HttpClientTests" name="test__034__RestClient__time__should_return_server_time()" time="0.2037259340286255">
        </testcase>
        <testcase classname="HttpClientTests" name="test__035__RestClient__Authentication__should_support_basic_authentication_when_an_API_key_is_provided_with_the_key_option()" time="0.2080249786376953">
        </testcase>
        <testcase classname="HttpClientTests" name="test__038__RestClient__Authentication__basic_authentication_flag__should_be_true_when_initialized_with_a_key()" time="0.0008699893951416016">
        </testcase>
        <testcase classname="HttpClientTests" name="test__039__RestClient__Authentication__basic_authentication_flag__should_be_false_when_options__useTokenAuth_is_set()" time="0.0006829500198364258">
        </testcase>
        <testcase classname="HttpClientTests" name="test__040__RestClient__Authentication__basic_authentication_flag__should_be_false_when_options__authUrl_is_set()" time="0.0006250143051147461">
        </testcase>
        <testcase classname="HttpClientTests" name="test__041__RestClient__Authentication__basic_authentication_flag__should_be_false_when_options__authCallback_is_set()" time="0.000635981559753418">
        </testcase>
        <testcase classname="HttpClientTests" name="test__042__RestClient__Authentication__basic_authentication_flag__should_be_false_when_options__tokenDetails_is_set()" time="0.0005239248275756836">
        </testcase>
        <testcase classname="HttpClientTests" name="test__043__RestClient__Authentication__basic_authentication_flag__should_be_false_when_options__token_is_set()" time="0.0006669759750366211">
        </testcase>
        <testcase classname="HttpClientTests" name="test__044__RestClient__Authentication__basic_authentication_flag__should_be_false_when_options__key_is_set()" time="0.0005600452423095703">
        </testcase>
        <testcase classname="HttpClientTests" name="test__045__RestClient__Host_Fallback__failing_HTTP_requests_with_custom_endpoint_should_result_in_an_error_immediately()" time="0.0058040618896484375">
        </testcase>
        <testcase classname="HttpClientTests" name="test__047__RestClient__Host_Fallback__won_t_apply_fallback_hosts_if_ClientOptions_fallbackHosts_array_is_empty()" time="0.0020209550857543945">
        </testcase>
        <testcase classname="HttpClientTests" name="test__048__RestClient__Host_Fallback__won_t_apply_custom_fallback_hosts_if_ClientOptions_fallbackHosts_and_ClientOptions_endpoint_are_not_set__use_defaults_instead()" time="0.0014330148696899414">
        </testcase>
        <testcase classname="HttpClientTests" name="test__049__RestClient__Host_Fallback__every_new_HTTP_request_is_first_attempted_to_the_default_primary_host()" time="1.1603829860687256">
        </testcase>
        <testcase classname="HttpClientTests" name="test__050__RestClient__Host_Fallback__should_not_use_an_alternative_host_when_the_client_receives_an_bad_request()" time="0.003960013389587402">
        </testcase>
        <testcase classname="HttpClientTests" name="test__055__RestClient__Host_Fallback__Fallback_behavior__should_be_applied_when_endpoint__port_and_tlsPort_has_not_been_set_to_an_explicit_value()" time="0.007429003715515137">
        </testcase>
        <testcase classname="HttpClientTests" name="test__056__RestClient__Host_Fallback__Fallback_behavior__should_NOT_be_applied_when_ClientOptions_endpoint_is_a_hostname()" time="0.015076041221618652">
        </testcase>
        <testcase classname="HttpClientTests" name="test__057__RestClient__Host_Fallback__Fallback_behavior__should_NOT_be_applied_when_ClientOptions_port_has_been_set()" time="0.002519965171813965">
        </testcase>
        <testcase classname="HttpClientTests" name="test__058__RestClient__Host_Fallback__Fallback_behavior__should_NOT_be_applied_when_ClientOptions_tlsPort_has_been_set()" time="0.00932002067565918">
        </testcase>
        <testcase classname="HttpClientTests" name="test__059__RestClient__Host_Fallback__Fallback_behavior__should_be_applied_when_ClientOptions_fallbackHosts_is_provided()" time="0.00196993350982666">
        </testcase>
        <testcase classname="HttpClientTests" name="test__061__RestClient__Host_Fallback__fallback_hosts_list_and_priorities__should_use_ClientOptions_fallbackHosts_when_list_is_provided()" time="0.003177046775817871">
        </testcase>
        <testcase classname="HttpClientTests" name="test__062__RestClient__Host_Fallback__fallback_hosts_list_and_priorities__should_use_nonprod_fallback_hosts_when_ClientOptions_endpoint_is_a_nonprod_routing_policy_and_ClientOptions_fallbackHosts_is_not_set()" time="0.0018690824508666992">
        </testcase>
        <testcase classname="HttpClientTests" name="test__063__RestClient__Host_Fallback__fallback_hosts_list_and_priorities__should_use_routing_policy_fallback_hosts_when_ClientOptions_endpoint_is_a_production_routing_policy()" time="0.04494309425354004">
        </testcase>
        <testcase classname="HttpClientTests" name="test__064__RestClient__Host_Fallback__fallback_hosts_list_and_priorities__should_use_default_fallback_hosts_when_both_ClientOptions_fallbackHosts_and_ClientOptions_endpoint_are_not_set()" time="0.012757062911987305">
        </testcase>
        <testcase classname="HttpClientTests" name="test__065__RestClient__Host_Fallback__retry_hosts_in_random_order__default_fallback_hosts_should_match_main__a_e__fallback_ably_realtime_com()" time="0.00955510139465332">
        </testcase>
        <testcase classname="HttpClientTests" name="test__066__RestClient__Host_Fallback__retry_hosts_in_random_order__routing_policy_fallback_hosts_have_the_format__id___a_e__fallback()" time="0.001782059669494629">
        </testcase>
        <testcase classname="HttpClientTests" name="test__066b__RestClient__Host_Fallback__an_endpoint_that_is_a_hostname_is_used_as_is_and_has_no_fallback_hosts()" time="0.0014600753784179688">
        </testcase>
        <testcase classname="HttpClientTests" name="test__067__RestClient__Host_Fallback__retry_hosts_in_random_order__until_httpMaxRetryCount_has_been_reached()" time="0.005120038986206055">
        </testcase>
        <testcase classname="HttpClientTests" name="test__068__RestClient__Host_Fallback__retry_hosts_in_random_order__use_custom_fallback_hosts_if_set()" time="0.0022530555725097656">
        </testcase>
        <testcase classname="HttpClientTests" name="test__069__RestClient__Host_Fallback__retry_hosts_in_random_order__until_all_fallback_hosts_have_been_tried()" time="0.014567017555236816">
        </testcase>
        <testcase classname="HttpClientTests" name="test__070__RestClient__Host_Fallback__retry_hosts_in_random_order__until_httpMaxRetryCount_has_been_reached__if_custom_fallback_hosts_are_provided_in_ClientOptions_fallbackHosts__then_they_will_be_used_instead()" time="0.0015439987182617188">
        </testcase>
        <testcase classname="HttpClientTests" name="test__071__RestClient__Host_Fallback__retry_hosts_in_random_order__until_all_fallback_hosts_have_been_tried__if_custom_fallback_hosts_are_provided_in_ClientOptions_fallbackHosts__then_they_will_be_used_instead()" time="0.008328080177307129">
        </testcase>
        <testcase classname="HttpClientTests" name="test__072__RestClient__Host_Fallback__retry_hosts_in_random_order__all_fallback_requests_headers_should_contain__Host__header_with_fallback_host_address()" time="0.001477956771850586">
        </testcase>
        <testcase classname="HttpClientTests" name="test__073__RestClient__Host_Fallback__retry_hosts_in_random_order__if_an_empty_array_of_fallback_hosts_is_provided__then_fallback_host_functionality_is_disabled()" time="0.0013140439987182617">
        </testcase>
        <testcase classname="HttpClientTests" name="test__074__RestClient__Host_Fallback__should_use_an_alternative_host_when___hostUnreachable()" time="0.009059906005859375">
        </testcase>
        <testcase classname="HttpClientTests" name="test__075__RestClient__Host_Fallback__should_use_an_alternative_host_when___requestTimeout_timeout__0_1_()" time="0.11185097694396973">
        </testcase>
        <testcase classname="HttpClientTests" name="test__076__RestClient__Host_Fallback__should_use_an_alternative_host_when___hostInternalError_code__501_()" time="0.0028319358825683594">
        </testcase>
        <testcase classname="HttpClientTests" name="test__077__RestClient__Host_Fallback__should_store_successful_fallback_host_as_default_host___hostUnreachable()" time="0.0021909475326538086">
        </testcase>
        <testcase classname="HttpClientTests" name="test__078__RestClient__Host_Fallback__should_store_successful_fallback_host_as_default_host___requestTimeout_timeout__0_1_()" time="0.1042710542678833">
        </testcase>
        <testcase classname="HttpClientTests" name="test__079__RestClient__Host_Fallback__should_store_successful_fallback_host_as_default_host___hostInternalError_code__501_()" time="0.0022439956665039062">
        </testcase>
        <testcase classname="HttpClientTests" name="test__080__RestClient__Host_Fallback__should_store_successful_fallback_host_as_default_host__should_restore_default_primary_host_after_fallbackRetryTimeout_expired___hostUnreachable()" time="1.181784987449646">
        </testcase>
        <testcase classname="HttpClientTests" name="test__081__RestClient__Host_Fallback__should_store_successful_fallback_host_as_default_host__should_restore_default_primary_host_after_fallbackRetryTimeout_expired___requestTimeout_timeout__0_1_()" time="1.2833529710769653">
        </testcase>
        <testcase classname="HttpClientTests" name="test__082__RestClient__Host_Fallback__should_store_successful_fallback_host_as_default_host__should_restore_default_primary_host_after_fallbackRetryTimeout_expired___hostInternalError_code__501_()" time="1.1829110383987427">
        </testcase>
        <testcase classname="HttpClientTests" name="test__083__RestClient__Host_Fallback__should_store_successful_fallback_host_as_default_host__should_use_another_fallback_host_if_previous_fallback_request_failed_and_store_it_as_default_if_current_fallback_request_succseeded___hostUnreachable()" time="0.029562950134277344">
        </testcase>
        <testcase classname="HttpClientTests" name="test__084__RestClient__Host_Fallback__should_store_successful_fallback_host_as_default_host__should_use_another_fallback_host_if_previous_fallback_request_failed_and_store_it_as_default_if_current_fallback_request_succseeded___requestTimeout_timeout__0_1_()" time="0.21674001216888428">
        </testcase>
        <testcase classname="HttpClientTests" name="test__085__RestClient__Host_Fallback__should_store_successful_fallback_host_as_default_host__should_use_another_fallback_host_if_previous_fallback_request_failed_and_store_it_as_default_if_current_fallback_request_succseeded___hostInternalError_code__501_()" time="0.005260944366455078">
        </testcase>
        <testcase classname="HttpClientTests" name="test__086__RestClient__request__method_signature_and_arguments__should_add_query_parameters()" time="0.028807997703552246">
        </testcase>
        <testcase classname="HttpClientTests" name="test__087__RestClient__request__method_signature_and_arguments__should_add_a_HTTP_body()" time="0.002048015594482422">
        </testcase>
        <testcase classname="HttpClientTests" name="test__088__RestClient__request__method_signature_and_arguments__should_add_a_HTTP_header()" time="0.001604914665222168">
        </testcase>
        <testcase classname="HttpClientTests" name="test__089__RestClient__request__method_signature_and_arguments__should_raise_if_method_is_invalid()" time="0.020123004913330078">
        </testcase>
        <testcase classname="HttpClientTests" name="test__090__RestClient__request__method_signature_and_arguments__should_raise_if_path_is_invalid()" time="0.0007989406585693359">
        </testcase>
        <testcase classname="HttpClientTests" name="test__091__RestClient__request__method_signature_and_arguments__should_raise_if_body_is_not_a_Dictionary_or_an_Array()" time="0.0007330179214477539">
        </testcase>
        <testcase classname="HttpClientTests" name="test__092__RestClient__request__method_signature_and_arguments__should_do_a_request_and_receive_a_valid_response()" time="0.385348916053772">
        </testcase>
        <testcase classname="HttpClientTests" name="test__093__RestClient__request__method_signature_and_arguments__should_handle_response_failures()" time="0.4354989528656006">
        </testcase>
        <testcase classname="HttpClientTests" name="test__094__RestClient__if_in_the_course_of_a_REST_request_an_attempt_to_authenticate_using_authUrl_fails_due_to_a_timeout__the_request_should_result_in_an_error_with_code_40170__statusCode_401__and_a_suitable_error_message()" time="3.552843928337097">
        </testcase>
        <testcase classname="HttpClientTests" name="test__095__RestClient__request_IDs__should_add__request_id__query_parameter()" time="0.003650069236755371">
        </testcase>
        <testcase classname="HttpClientTests" name="test__096__RestClient__request_IDs__should_remain_the_same_if_a_request_is_retried_to_a_fallback_host()" time="0.01590704917907715">
        </testcase>
        <testcase classname="HttpClientTests" name="test__097__RestClient__request_IDs__ErrorInfo_should_have__requestId__property()" time="0.0011900663375854492">
        </testcase>
        <testcase classname="HttpPaginatedTests" name="test__001__RestPaginated__should_extract_links_from_the_response()" time="0.0020459890365600586">
        </testcase>
        <testcase classname="HttpPaginatedTests" name="test__002__RestPaginated__should_create_next_first_last_request_from_extracted_link_path()" time="0.0019290447235107422">
        </testcase>
        <testcase classname="LogAdapterTests" name="test_logLevel()" time="0.0016230344772338867">
        </testcase>
        <testcase classname="LogAdapterTests" name="test_logMessage()" time="0.0018429756164550781">
        </testcase>
        <testcase classname="LogAdapterTests" name="test_setLogLevel()" time="0.0013049840927124023">
        </testcase>
        <testcase classname="MessageUpdatesDeletesTests" name="test__RSL11__getMessage()" time="1.440316081047058">
        </testcase>
        <testcase classname="MessageUpdatesDeletesTests" name="test__RSL15__appendMessage()" time="1.537485957145691">
        </testcase>
        <testcase classname="MessageUpdatesDeletesTests" name="test__RSL15__deleteMessage()" time="1.512363076210022">
        </testcase>
        <testcase classname="MessageUpdatesDeletesTests" name="test__RSL15__RSL14__updateMessage__and__getMessageVersions()" time="2.6267529726028442">
        </testcase>
        <testcase classname="MessageUpdatesDeletesTests" name="test__RTL28__getMessage()" time="1.745318055152893">
        </testcase>
        <testcase classname="MessageUpdatesDeletesTests" name="test__RTL32__appendMessage()" time="1.937195062637329">
        </testcase>
        <testcase classname="MessageUpdatesDeletesTests" name="test__RTL32__deleteMessage()" time="1.8464020490646362">
        </testcase>
        <testcase classname="MessageUpdatesDeletesTests" name="test__RTL32__RTL31__updateMessage__and__getMessageVersions()" time="2.893172025680542">
        </testcase>
        <testcase classname="MessageUpdatesDeletesTests" name="test_subscribeToAppends()" time="1.756438970565796">
        </testcase>
        <testcase classname="ObjectLifetimesTests" name="test__001__ObjectLifetimes__user_code_releases_public_object__the_object_s_internal_child_s_back_reference_is_released_too()" time="0.021812915802001953">
        </testcase>
        <testcase classname="ObjectLifetimesTests" name="test__002__ObjectLifetimes__user_code_holds_only_reference_to_public_object_s_public_child__still_can_access_parent_s_internal_object()" time="0.0009610652923583984">
        </testcase>
        <testcase classname="ObjectLifetimesTests" name="test__003__ObjectLifetimes__user_code_holds_only_reference_to_public_object_s_public_child__when_it_s_released__schedules_async_release_of_parent_s_internal_object_in_internal_queue()" time="0.0008620023727416992">
        </testcase>
        <testcase classname="ObjectLifetimesTests" name="test__004__ObjectLifetimes__when_user_leaves_Realtime_open__still_works()" time="0.5593559741973877">
        </testcase>
        <testcase classname="ObjectLifetimesTests" name="test__005__ObjectLifetimes__when_Realtime_is_closed_and_user_loses_its_reference__channels_don_t_leak()" time="0.46146202087402344">
        </testcase>
        <testcase classname="PluginAPITests" name="test_channelAttachedNotifiesPlugin()" time="0.4756559133529663">
        </testcase>
        <testcase classname="PluginAPITests" name="test_channelStateChangeNotifiesPlugin()" time="0.37803196907043457">
        </testcase>
        <testcase classname="PluginAPITests" name="test_connectionDetailsCallbackOnConnected()" time="0.30024707317352295">
        </testcase>
        <testcase classname="PluginAPITests" name="test_fetchServerTime()" time="0.18592488765716553">
        </testcase>
        <testcase classname="PluginAPITests" name="test_latestConnectionDetails()" time="0.2889930009841919">
        </testcase>
        <testcase classname="PluginAPITests" name="test_sendObject()" time="0.3648730516433716">
        </testcase>
        <testcase classname="PubSubDeviceTests" name="test__001__createClient__declares_the_device_agent_without_a_version()" time="0.002200007438659668">
        </testcase>
        <testcase classname="PubSubDeviceTests" name="test__002__createClient__leaves_the_callers_options_untouched()" time="0.0008070468902587891">
        </testcase>
        <testcase classname="PubSubDeviceTests" name="test__003__createClient__preserves_agents_supplied_by_the_caller()" time="0.017964959144592285">
        </testcase>
        <testcase classname="PubSubDeviceTests" name="test__004__createClient__the_declaration_wins_over_a_caller_entry_of_the_same_name()" time="0.002187967300415039">
        </testcase>
        <testcase classname="PubSubDeviceTests" name="test__005__createClient__carries_over_the_rest_of_the_options()" time="0.012540936470031738">
        </testcase>
        <testcase classname="PubSubDeviceTests" name="test__006__createClient__accepts_a_key()" time="0.0032041072845458984">
        </testcase>
        <testcase classname="PubSubDeviceTests" name="test__007__createClient__accepts_a_token()" time="0.003679037094116211">
        </testcase>
        <testcase classname="PubSubDeviceTests" name="test__008__createClient__sends_the_declaration_on_the_realtime_connection()" time="0.32727503776550293">
        </testcase>
        <testcase classname="PubSubDeviceTests" name="test__009__createClient__sends_the_declaration_on_http_requests()" time="0.17919504642486572">
        </testcase>
        <testcase classname="PubSubDeviceTests" name="test__010__the_core_constructor__declares_nothing()" time="0.001323103904724121">
        </testcase>
        <testcase classname="PubSubDeviceTests" name="test__011__createClient__carries_over_the_plugins()" time="0.006076931953430176">
        </testcase>
        <testcase classname="PubSubDeviceTests" name="test__011__createClient__the_full_agent_identifier()" time="0.0024019479751586914">
        </testcase>
        <testcase classname="RealtimeAnnotationsTests" name="test__annotation_data_uses_a_cipher_added_by_setOptions_after_channel_creation()" time="0.5492019653320312">
        </testcase>
        <testcase classname="RealtimeAnnotationsTests" name="test__annotations_subscribe_should_implicitly_attach_the_channel_if_options_attachOnSubscribe_is_true()" time="1.7972760200500488">
            <failure message="XCTAssertNil failed: &quot;Error 80017 - connection broken before receiving publishing acknowledgment&quot; (/Users/runner/work/ably-cocoa/ably-cocoa/Test/AblyTests/Tests/RealtimeAnnotationsTests.swift#EndingLineNumber=429&amp;StartingLineNumber=429)">
            </failure>
        </testcase>
        <testcase classname="RealtimeAnnotationsTests" name="test__annotations_subscribe_should_implicitly_attach_the_channel_if_options_attachOnSubscribe_is_true()" time="0.7093960046768188">
        </testcase>
        <testcase classname="RealtimeAnnotationsTests" name="test__annotations_subscribe_should_not_implicitly_attach_the_channel_if_options_attachOnSubscribe_is_false()" time="1.063504934310913">
        </testcase>
        <testcase classname="RealtimeAnnotationsTests" name="test__annotations_subscribe_should_not_result_in_an_error_if_channel_is_in_the_FAILED_state_and_options_attachOnSubscribe_is_false()" time="1.070834994316101">
        </testcase>
        <testcase classname="RealtimeAnnotationsTests" name="test__annotations_subscribe_should_result_in_an_error_if_channel_is_in_the_FAILED_state_and_options_attachOnSubscribe_is_true()" time="0.018881916999816895">
        </testcase>
        <testcase classname="RealtimeAnnotationsTests" name="test__if_annotation_subscribe_mode_is_missing_from_channel_options_then_subscription_will_not_work()" time="1.602829098701477">
        </testcase>
        <testcase classname="RealtimeAnnotationsTests" name="test__publish_annotation_exceeding_max_message_size()" time="0.42122793197631836">
        </testcase>
        <testcase classname="RealtimeAnnotationsTests" name="test__publish_delete_and_get_annotations()" time="3.663583993911743">
        </testcase>
        <testcase classname="RealtimeClientChannelTests" name="test__001__Channel__should_process_all_incoming_messages_and_presence_messages_as_soon_as_a_Channel_becomes_attached()" time="1.0553189516067505">
        </testcase>
        <testcase classname="RealtimeClientChannelTests" name="test__002__Channel__should_not_crash_when_an_ATTACH_request_is_responded_with_a_DETACHED()" time="0.42126190662384033">
        </testcase>
        <testcase classname="RealtimeClientChannelTests" name="test__003__Channel__EventEmitter__channel_states_and_events__should_implement_the_EventEmitter_and_emit_events_for_state_changes()" time="0.42699098587036133">
        </testcase>
        <testcase classname="RealtimeClientChannelTests" name="test__004__Channel__EventEmitter__channel_states_and_events__should_implement_the_EventEmitter_and_emit_events_for_FAILED_state_changes()" time="0.5600930452346802">
        </testcase>
        <testcase classname="RealtimeClientChannelTests" name="test__005__Channel__EventEmitter__channel_states_and_events__should_implement_the_EventEmitter_and_emit_events_for_SUSPENDED_state_changes()" time="0.3976399898529053">
        </testcase>
        <testcase classname="RealtimeClientChannelTests" name="test__006__Channel__EventEmitter__channel_states_and_events__can_emit_an_UPDATE_event()" time="0.37271392345428467">
        </testcase>
        <testcase classname="RealtimeClientChannelTests" name="test__007__Channel__EventEmitter__channel_states_and_events__should_not_emit_detached_event_on_an_already_detached_channel()" time="0.5347869396209717">
        </testcase>
        <testcase classname="RealtimeClientChannelTests" name="test__008__Channel__EventEmitter__channel_states_and_events__state_attribute_should_be_the_current_state_of_the_channel()" time="0.38377904891967773">
        </testcase>
        <testcase classname="RealtimeClientChannelTests" name="test__009__Channel__EventEmitter__channel_states_and_events__should_contain_an_ErrorInfo_object_with_details_when_an_error_occurs()" time="0.0023679733276367188">
        </testcase>
        <testcase classname="RealtimeClientChannelTests" name="test__010__Channel__EventEmitter__channel_states_and_events__a_ChannelStateChange_is_emitted_as_the_first_argument_for_every_channel_state_change()" time="0.38297104835510254">
        </testcase>
        <testcase classname="RealtimeClientChannelTests" name="test__011a__Channel__EventEmitter__channel_states_and_events__ChannelStateChange_will_contain_a_resumed_boolean_attribute_with_value__true__if_the_bit_flag_RESUMED_was_included()" time="4.919234991073608">
        </testcase>
        <testcase classname="RealtimeClientChannelTests" name="test__011b__Channel__EventEmitter__channel_states_and_events__ChannelStateChange_will_contain_a_resumed_boolean_attribute_with_value__true__if_the_bit_flag_RESUMED_was_included_for_recovered_connection()" time="0.7505239248275757">
        </testcase>
        <testcase classname="RealtimeClientChannelTests" name="test__013__Channel__connection_state__if_the_connection_state_enters_the_CONNECTED_state__then_a_SUSPENDED_channel_will_transition_to_ATTACHING_and_goes_back_to_SUSPNDED_on_timeout()" time="4.075991988182068">
        </testcase>
        <testcase classname="RealtimeClientChannelTests" name="test__015__Channel__connection_state__should_attach_successfully_and_remain_attached_after_the_connection_goes_from_SUSPENDED_to_CONNECTED()" time="8.555158972740173">
        </testcase>
        <testcase classname="RealtimeClientChannelTests" name="test__016__Channel__connection_state__if_the_connection_state_enters_the_DISCONNECTED_state__it_will_have_no_effect_on_the_channel_states()" time="4.36224102973938">
        </testcase>
        <testcase classname="RealtimeClientChannelTests" name="test__017__Channel__connection_state__changes_to_FAILED__ATTACHING_channel_should_transition_to_FAILED()" time="0.004414081573486328">
        </testcase>
        <testcase classname="RealtimeClientChannelTests" name="test__018__Channel__connection_state__changes_to_FAILED__ATTACHED_channel_should_transition_to_FAILED()" time="0.4069790840148926">
        </testcase>
        <testcase classname="RealtimeClientChannelTests" name="test__019__Channel__connection_state__changes_to_FAILED__channel_being_released_waiting_for_DETACH_shouldn_t_crash__issue__918_()" time="0.01973903179168701">
        </testcase>
        <testcase classname="RealtimeClientChannelTests" name="test__020__Channel__connection_state__changes_to_FAILED__should_immediately_fail_if_not_in_the_connected_state()" time="0.003303050994873047">
        </testcase>
        <testcase classname="RealtimeClientChannelTests" name="test__021__Channel__connection_state__changes_to_FAILED__should_keep_the_channels_attached_when_client_reconnected_successfully_and_queue_messages_is_disabled()" time="0.8196710348129272">
        </testcase>
        <testcase classname="RealtimeClientChannelTests" name="test__022__Channel__connection_state__changes_to_CLOSED__ATTACHING_channel_should_transition_to_DETACHED()" time="0.44685304164886475">
        </testcase>
        <testcase classname="RealtimeClientChannelTests" name="test__023__Channel__connection_state__changes_to_CLOSED__ATTACHED_channel_should_transition_to_DETACHED()" time="0.4577369689941406">
        </testcase>
        <testcase classname="RealtimeClientChannelTests" name="test__024__Channel__connection_state__changes_to_SUSPENDED__ATTACHING_channel_should_transition_to_SUSPENDED()" time="0.3184419870376587">
        </testcase>
        <testcase classname="RealtimeClientChannelTests" name="test__025__Channel__connection_state__changes_to_SUSPENDED__ATTACHED_channel_should_transition_to_SUSPENDED()" time="0.36583495140075684">
        </testcase>
        <testcase classname="RealtimeClientChannelTests" name="test__026__Channel__connection_state__changes_to_SUSPENDED__channel_being_released_waiting_for_DETACH_shouldn_t_crash__issue__918_()" time="0.02707195281982422">
        </testcase>
        <testcase classname="RealtimeClientChannelTests" name="test__027__Channel__attach__if_already_ATTACHED_or_ATTACHING_nothing_is_done()" time="0.4157499074935913">
        </testcase>
        <testcase classname="RealtimeClientChannelTests" name="test__028__Channel__attach__if_the_user_does_not_have_sufficient_permissions_to_attach__then_the_channel_will_transition_to_FAILED_and_set_the_errorReason()" time="0.5688869953155518">
        </testcase>
        <testcase classname="RealtimeClientChannelTests" name="test__029__Channel__attach__if_the_channel_is_in_the_FAILED_state__the_attach_request_sets_its_errorReason_to_null__and_proceeds_with_a_channel_attach()" time="0.4554020166397095">
        </testcase>
        <testcase classname="RealtimeClientChannelTests" name="test__030__Channel__attach__should_send_an_ATTACH_ProtocolMessage__change_state_to_ATTACHING_and_change_state_to_ATTACHED_after_confirmation()" time="0.39495301246643066">
        </testcase>
        <testcase classname="RealtimeClientChannelTests" name="test__031__Channel__attach__should_transition_the_channel_state_to_FAILED_if_the_user_does_not_have_sufficient_permissions()" time="0.5858219861984253">
        </testcase>
        <testcase classname="RealtimeClientChannelTests" name="test__032__Channel__attach__should_transition_the_channel_state_to_SUSPENDED_if_ATTACHED_ProtocolMessage_is_not_received()" time="2.448364019393921">
        </testcase>
        <testcase classname="RealtimeClientChannelTests" name="test__033__Channel__attach__if_called_with_a_callback_should_call_it_once_attached()" time="0.38349294662475586">
        </testcase>
        <testcase classname="RealtimeClientChannelTests" name="test__034__Channel__attach__if_called_with_a_callback_and_already_attaching_should_call_the_callback_once_attached()" time="0.38675105571746826">
        </testcase>
        <testcase classname="RealtimeClientChannelTests" name="test__035__Channel__attach__if_called_with_a_callback_and_already_attached_should_call_the_callback_with_nil_error()" time="0.3956340551376343">
        </testcase>
        <testcase classname="RealtimeClientChannelTests" name="test__036__Channel__attach__if_the_channel_is_in_a_pending_state_ATTACHING__do_the_attach_operation_after_the_completion_of_the_pending_request()" time="0.3690760135650635">
        </testcase>
        <testcase classname="RealtimeClientChannelTests" name="test__037__Channel__attach__if_the_channel_is_in_a_pending_state_DETACHING__do_the_attach_operation_after_the_completion_of_the_pending_request()" time="0.5176470279693604">
        </testcase>
        <testcase classname="RealtimeClientChannelTests" name="test__038__Channel__attach__a_channel_in_DETACHING_can_actually_move_back_to_ATTACHED_if_it_fails_to_detach()" time="1.410154938697815">
        </testcase>
        <testcase classname="RealtimeClientChannelTests" name="test__039__Channel__attach__results_in_an_error_if_the_connection_state_is__CLOSING()" time="0.3259090185165405">
        </testcase>
        <testcase classname="RealtimeClientChannelTests" name="test__040__Channel__attach__results_in_an_error_if_the_connection_state_is__CLOSED()" time="0.3551599979400635">
        </testcase>
        <testcase classname="RealtimeClientChannelTests" name="test__041__Channel__attach__results_in_an_error_if_the_connection_state_is__SUSPENDED()" time="0.0013179779052734375">
        </testcase>
        <testcase classname="RealtimeClientChannelTests" name="test__042__Channel__attach__results_in_an_error_if_the_connection_state_is__FAILED()" time="0.002084016799926758">
        </testcase>
        <testcase classname="RealtimeClientChannelTests" name="test__043__Channel__attach__happens_when_connection_is_CONNECTED_if_it_s_currently__INITIALIZED()" time="0.39175307750701904">
        </testcase>
        <testcase classname="RealtimeClientChannelTests" name="test__044__Channel__attach__happens_when_connection_is_CONNECTED_if_it_s_currently__CONNECTING()" time="0.43932902812957764">
        </testcase>
        <testcase classname="RealtimeClientChannelTests" name="test__045__Channel__attach__happens_when_connection_is_CONNECTED_if_it_s_currently__DISCONNECTED()" time="0.7721890211105347">
        </testcase>
        <testcase classname="RealtimeClientChannelTests" name="test__046__Channel__attach__attach_resume__should_pass_attach_resume_flag_in_attach_message()" time="0.46822500228881836">
        </testcase>
        <testcase classname="RealtimeClientChannelTests" name="test__047__Channel__attach__attach_resume__should_have_correct_AttachResume_value()" time="0.3718090057373047">
        </testcase>
        <testcase classname="RealtimeClientChannelTests" name="test__048__Channel__attach__attach_resume__should_encode_correctly_the_AttachResume_flag()" time="2.8821849822998047">
        </testcase>
        <testcase classname="RealtimeClientChannelTests" name="test__049__Channel__detach__if_state_is_INITIALIZED_or_DETACHED_nothing_is_done()" time="0.794564962387085">
        </testcase>
        <testcase classname="RealtimeClientChannelTests" name="test__050__Channel__detach__if_the_channel_is_in_a_pending_state_DETACHING__do_the_detach_operation_after_the_completion_of_the_pending_request()" time="1.4767210483551025">
        </testcase>
        <testcase classname="RealtimeClientChannelTests" name="test__051__Channel__detach__if_the_channel_is_in_a_pending_state_ATTACHING__do_the_detach_operation_after_the_completion_of_the_pending_request()" time="0.36653101444244385">
        </testcase>
        <testcase classname="RealtimeClientChannelTests" name="test__052__Channel__detach__results_in_an_error_if_the_connection_state_is_FAILED()" time="0.0016939640045166016">
        </testcase>
        <testcase classname="RealtimeClientChannelTests" name="test__053__Channel__detach__should_send_a_DETACH_ProtocolMessage__change_state_to_DETACHING_and_change_state_to_DETACHED_after_confirmation()" time="0.427604079246521">
        </testcase>
        <testcase classname="RealtimeClientChannelTests" name="test__054__Channel__detach__if_called_with_a_callback_should_call_it_once_detached()" time="0.4737510681152344">
        </testcase>
        <testcase classname="RealtimeClientChannelTests" name="test__055__Channel__detach__if_called_with_a_callback_and_already_detaching_should_call_the_callback_once_detached()" time="0.4665958881378174">
        </testcase>
        <testcase classname="RealtimeClientChannelTests" name="test__056__Channel__detach__if_called_with_a_callback_and_already_detached_should_should_call_the_callback_with_nil_error()" time="0.44554710388183594">
        </testcase>
        <testcase classname="RealtimeClientChannelTests" name="test__057__Channel__detach__if_a_DETACHED_is_not_received_within_the_default_realtime_request_timeout__the_detach_request_should_be_treated_as_though_it_has_failed_and_the_channel_will_return_to_its_previous_state()" time="1.388679027557373">
        </testcase>
        <testcase classname="RealtimeClientChannelTests" name="test__058__Channel__detach__if_the_channel_state_is_SUSPENDED__the__detach__request_transitions_the_channel_immediately_to_the_DETACHED_state()" time="0.3757660388946533">
        </testcase>
        <testcase classname="RealtimeClientChannelTests" name="test__059__Channel__detach__results_in_an_error_if_the_connection_state_is__CLOSING()" time="0.38972604274749756">
        </testcase>
        <testcase classname="RealtimeClientChannelTests" name="test__060__Channel__detach__results_in_an_error_if_the_connection_state_is__FAILED()" time="0.39474403858184814">
        </testcase>
        <testcase classname="RealtimeClientChannelTests" name="test__061__Channel__detach__happens_when_channel_is_ATTACHED_if_connection_is_currently__INITIALIZED()" time="0.4443260431289673">
        </testcase>
        <testcase classname="RealtimeClientChannelTests" name="test__062__Channel__detach__happens_when_channel_is_ATTACHED_if_connection_is_currently__CONNECTING()" time="0.46039295196533203">
        </testcase>
        <testcase classname="RealtimeClientChannelTests" name="test__063__Channel__detach__happens_when_channel_is_ATTACHED_if_connection_is_currently__DISCONNECTED()" time="0.8616139888763428">
        </testcase>
        <testcase classname="RealtimeClientChannelTests" name="test__064__Channel__publish__should_encode_messages_in_the_same_way_as_the_RestChannel()" time="0.6415410041809082">
        </testcase>
        <testcase classname="RealtimeClientChannelTests" name="test__065__Channel__publish__Message_connectionId_should_match_the_current_Connection_id_for_all_published_messages()" time="0.44285905361175537">
        </testcase>
        <testcase classname="RealtimeClientChannelTests" name="test__066__Channel__publish__should_provide_an_optional_argument_that_allows_the_clientId_value_to_be_specified()" time="0.46883296966552734">
        </testcase>
        <testcase classname="RealtimeClientChannelTests" name="test__067__Channel__publish__should_invoke_callback__when_the_message_is_successfully_delivered()" time="0.43381309509277344">
        </testcase>
        <testcase classname="RealtimeClientChannelTests" name="test__068__Channel__publish__should_invoke_callback__upon_failure()" time="0.7231400012969971">
        </testcase>
        <testcase classname="RealtimeClientChannelTests" name="test__069__Channel__publish__should_invoke_callback__for_all_messages_published()" time="1.3480290174484253">
        </testcase>
        <testcase classname="RealtimeClientChannelTests" name="test__070__Channel__publish__Connection_state_conditions__publish_should_not_trigger_an_implicit_attach()" time="0.392253041267395">
        </testcase>
        <testcase classname="RealtimeClientChannelTests" name="test__071__Channel__publish__Connection_state_conditions__if_the_connection_is_CONNECTED_and_the_channel_is__ATTACHED_then_the_messages_should_be_published_immediately()" time="0.4336049556732178">
        </testcase>
        <testcase classname="RealtimeClientChannelTests" name="test__072__Channel__publish__Connection_state_conditions__if_the_connection_is_CONNECTED_and_the_channel_is__INITIALIZED_then_the_messages_should_be_published_immediately()" time="0.38956892490386963">
        </testcase>
        <testcase classname="RealtimeClientChannelTests" name="test__073__Channel__publish__Connection_state_conditions__if_the_connection_is_CONNECTED_and_the_channel_is__DETACHED_then_the_messages_should_be_published_immediately()" time="0.5377680063247681">
        </testcase>
        <testcase classname="RealtimeClientChannelTests" name="test__074__Channel__publish__Connection_state_conditions__if_the_connection_is_CONNECTED_and_the_channel_is__ATTACHING_then_the_messages_should_be_published_immediately()" time="0.4476059675216675">
        </testcase>
        <testcase classname="RealtimeClientChannelTests" name="test__075__Channel__publish__Connection_state_conditions__if_the_connection_is_CONNECTED_and_the_channel_is__DETACHING_then_the_messages_should_be_published_immediately()" time="0.6302709579467773">
        </testcase>
        <testcase classname="RealtimeClientChannelTests" name="test__076__Channel__publish__Connection_state_conditions__the_message__should_be_queued_and_delivered_as_soon_as_the_connection_state_returns_to_CONNECTED_if_the_connection_is__INITIALIZED()" time="0.5653929710388184">
        </testcase>
        <testcase classname="RealtimeClientChannelTests" name="test__077__Channel__publish__Connection_state_conditions__the_message__should_be_queued_and_delivered_as_soon_as_the_connection_state_returns_to_CONNECTED_if_the_connection_is__CONNECTING()" time="0.5651129484176636">
        </testcase>
        <testcase classname="RealtimeClientChannelTests" name="test__078__Channel__publish__Connection_state_conditions__the_message__should_be_queued_and_delivered_as_soon_as_the_connection_state_returns_to_CONNECTED_if_the_connection_is__DISCONNECTED()" time="0.9664009809494019">
        </testcase>
        <testcase classname="RealtimeClientChannelTests" name="test__082__Channel__publish__Connection_state_conditions__will_result_in_an_error_if_the__connection_is_SUSPENDED()" time="0.31348705291748047">
        </testcase>
        <testcase classname="RealtimeClientChannelTests" name="test__083__Channel__publish__Connection_state_conditions__will_result_in_an_error_if_the__connection_is_CLOSING()" time="0.31430602073669434">
        </testcase>
        <testcase classname="RealtimeClientChannelTests" name="test__084__Channel__publish__Connection_state_conditions__will_result_in_an_error_if_the__connection_is_CLOSED()" time="0.36469101905822754">
        </testcase>
        <testcase classname="RealtimeClientChannelTests" name="test__085__Channel__publish__Connection_state_conditions__will_result_in_an_error_if_the__connection_is_FAILED()" time="0.31549501419067383">
        </testcase>
        <testcase classname="RealtimeClientChannelTests" name="test__086__Channel__publish__Connection_state_conditions__will_result_in_an_error_if_the__channel_is_SUSPENDED()" time="0.37434399127960205">
        </testcase>
        <testcase classname="RealtimeClientChannelTests" name="test__087__Channel__publish__Connection_state_conditions__will_result_in_an_error_if_the__channel_is_FAILED()" time="0.3627849817276001">
        </testcase>
        <testcase classname="RealtimeClientChannelTests" name="test__095__Channel__publish__Unidentified_clients_using_Basic_Auth__should_have_the_provided_clientId_on_received_message_when_it_was_published_with_clientId()" time="0.45383501052856445">
        </testcase>
        <testcase classname="RealtimeClientChannelTests" name="test__096__Channel__publish__expect_either__an_array_of_Message_objects()" time="0.4698280096054077">
        </testcase>
        <testcase classname="RealtimeClientChannelTests" name="test__097__Channel__publish__expect_either__a_name_string_and_data_payload()" time="0.42665696144104004">
        </testcase>
        <testcase classname="RealtimeClientChannelTests" name="test__098__Channel__publish__expect_either__allows_name_to_be_null()" time="0.4508019685745239">
        </testcase>
        <testcase classname="RealtimeClientChannelTests" name="test__099__Channel__publish__expect_either__allows_data_to_be_null()" time="0.44731807708740234">
        </testcase>
        <testcase classname="RealtimeClientChannelTests" name="test__100__Channel__publish__expect_either__allows_name_and_data_to_be_assigned()" time="0.4028509855270386">
        </testcase>
        <testcase classname="RealtimeClientChannelTests" name="test__101__Channel__publish__Identified_clients_with_clientId__when_publishing_a_Message_with_the_clientId_attribute_value_set_to_the_identified_client_s_clientId()" time="0.42646098136901855">
        </testcase>
        <testcase classname="RealtimeClientChannelTests" name="test__102__Channel__publish__Identified_clients_with_clientId__when_publishing_a_Message_with_a_different_clientId_attribute_value_from_the_identified_client_s_clientId__it_should_reject_that_publish_operation_immediately()" time="0.3809480667114258">
        </testcase>
        <testcase classname="RealtimeClientChannelTests" name="test__103__Channel__publish__Identified_clients_with_clientId__message_should_be_published_following_authentication_and_received_back_with_the_clientId_intact()" time="0.6114739179611206">
        </testcase>
        <testcase classname="RealtimeClientChannelTests" name="test__104__Channel__publish__Identified_clients_with_clientId__message_should_be_rejected_by_the_Ably_service_and_the_message_error_should_contain_the_server_error()" time="0.5540580749511719">
        </testcase>
        <testcase classname="RealtimeClientChannelTests" name="test__105__Channel__publish__Identified_clients_with_clientId__When_publishing_a_Message_with_clientId_set_to_null__should_be_unnecessary_to_set_clientId_of_the_Message_before_publishing_and_have_clientId_value_set_for_the_Message_when_received()" time="0.44067490100860596">
        </testcase>
        <testcase classname="RealtimeClientChannelTests" name="test__106__Channel__subscribe__with_no_arguments_subscribes_a_listener_to_all_messages()" time="0.4833739995956421">
        </testcase>
        <testcase classname="RealtimeClientChannelTests" name="test__107__Channel__subscribe__with_a_single_name_argument_subscribes_a_listener_to_only_messages_whose_name_member_matches_the_string_name()" time="0.43334197998046875">
        </testcase>
        <testcase classname="RealtimeClientChannelTests" name="test__108__Channel__subscribe__with_a_attach_callback_should_subscribe_and_call_the_callback_when_attached()" time="0.4327300786972046">
        </testcase>
        <testcase classname="RealtimeClientChannelTests" name="test__109__Channel__subscribe__should_implicitly_attach_the_channel_if_options_attachOnSubscribe_is_true()" time="0.6585190296173096">
        </testcase>
        <testcase classname="RealtimeClientChannelTests" name="test__109b__Channel__subscribe__should_not_implicitly_attach_the_channel_if_options_attachOnSubscribe_is_false()" time="1.0675410032272339">
        </testcase>
        <testcase classname="RealtimeClientChannelTests" name="test__110__Channel__subscribe__should_result_in_an_error_if_channel_is_in_the_FAILED_state_and_options_attachOnSubscribe_is_true()" time="0.010902047157287598">
        </testcase>
        <testcase classname="RealtimeClientChannelTests" name="test__110b__Channel__subscribe__should_not_result_in_an_error_if_channel_is_in_the_FAILED_state_and_options_attachOnSubscribe_is_false()" time="1.07197904586792">
        </testcase>
        <testcase classname="RealtimeClientChannelTests" name="test__111__Channel__subscribe__should_exist_ensuring_published_messages_are_not_echoed_back_to_the_subscriber_when_echoMessages_is_false()" time="1.6151399612426758">
        </testcase>
        <testcase classname="RealtimeClientChannelTests" name="test__112__Channel__subscribe__should_deliver_the_message_even_if_there_is_an_error_while_decoding__using_crypto_data_128()" time="0.42905402183532715">
        </testcase>
        <testcase classname="RealtimeClientChannelTests" name="test__113__Channel__subscribe__should_deliver_the_message_even_if_there_is_an_error_while_decoding__using_crypto_data_256()" time="0.46562790870666504">
        </testcase>
        <testcase classname="RealtimeClientChannelTests" name="test__114__Channel__subscribe__message_cannot_be_decoded_or_decrypted__should_deliver_with_encoding_attribute_set_indicating_the_residual_encoding_and_error_should_be_emitted()" time="0.4430900812149048">
        </testcase>
        <testcase classname="RealtimeClientChannelTests" name="test__115__Channel__unsubscribe__with_no_arguments_unsubscribes_the_provided_listener_to_all_messages_if_subscribed()" time="0.45601093769073486">
        </testcase>
        <testcase classname="RealtimeClientChannelTests" name="test__116__Channel__unsubscribe__with_a_single_name_argument_unsubscribes_the_provided_listener_if_previously_subscribed_with_a_name_specific_subscription()" time="0.4807150363922119">
        </testcase>
        <testcase classname="RealtimeClientChannelTests" name="test__117__Channel__history__should_support_all_the_same_params_as_Rest()" time="0.6059540510177612">
        </testcase>
        <testcase classname="RealtimeClientChannelTests" name="test__118__Channel__history__should_return_a_PaginatedResult_page()" time="0.5678479671478271">
        </testcase>
        <testcase classname="RealtimeClientChannelTests" name="test__119__Channel__history__should_retrieve_all_available_messages()" time="0.8060040473937988">
        </testcase>
        <testcase classname="RealtimeClientChannelTests" name="test__120__Channel__history__attached_channel_may_receive_an_additional_ATTACHED_ProtocolMessage()" time="0.35975098609924316">
        </testcase>
        <testcase classname="RealtimeClientChannelTests" name="test__121__Channel__history__If_an_ERROR_ProtocolMessage_is_received_for_this_channel_then_the_channel_should_immediately_transition_to_the_FAILED_state__the_errorReason_should_be_set_and_an_error_should_be_emitted_on_the_channel()" time="0.38011598587036133">
        </testcase>
        <testcase classname="RealtimeClientChannelTests" name="test__122__Channel__history__should_not_emit_messages_to_subscribers_if_the_channel_is_in_any_state_other_than_ATTACHED()" time="3.659993052482605">
        </testcase>
        <testcase classname="RealtimeClientChannelTests" name="test__123__Channel__history__supports_the_param_untilAttach__should_be_false_as_default()" time="0.000928044319152832">
        </testcase>
        <testcase classname="RealtimeClientChannelTests" name="test__124__Channel__history__supports_the_param_untilAttach__should_invoke_an_error_when_the_untilAttach_is_specified_and_the_channel_is_not_attached()" time="0.00575101375579834">
        </testcase>
        <testcase classname="RealtimeClientChannelTests" name="test__125__Channel__history__supports_the_param_untilAttach__where_value_is_true__should_pass_the_querystring_param_fromSerial_with_the_serial_number_assigned_to_the_channel()" time="0.5852940082550049">
        </testcase>
        <testcase classname="RealtimeClientChannelTests" name="test__126__Channel__history__supports_the_param_untilAttach__where_value_is_false__should_pass_the_querystring_param_fromSerial_with_the_serial_number_assigned_to_the_channel()" time="0.7125539779663086">
        </testcase>
        <testcase classname="RealtimeClientChannelTests" name="test__127__Channel__history__supports_the_param_untilAttach__should_retrieve_messages_prior_to_the_moment_that_the_channel_was_attached()" time="1.1486049890518188">
        </testcase>
        <testcase classname="RealtimeClientChannelTests" name="test__128__Channel__history__if_the_channel_receives_a_server_initiated_DETACHED_message_when__the_channel_is_in_the_ATTACHED_states__an_attempt_to_reattach_the_channel_should_be_made_immediately_by_sending_a_new_ATTACH_message_and_the_channel_should_transition_to_the_ATTACHING_state_with_the_error_emitted_in_the_ChannelStateChange_event()" time="0.3721081018447876">
        </testcase>
        <testcase classname="RealtimeClientChannelTests" name="test__129__Channel__history__if_the_channel_receives_a_server_initiated_DETACHED_message_when__the_channel_is_in_the_SUSPENDED_state__an_attempt_to_reattach_the_channel_should_be_made_immediately_by_sending_a_new_ATTACH_message_and_the_channel_should_transition_to_the_ATTACHING_state_with_the_error_emitted_in_the_ChannelStateChange_event()" time="1.3599580526351929">
        </testcase>
        <testcase classname="RealtimeClientChannelTests" name="test__130__Channel__history__if_the_channel_receives_a_server_initiated_DETACHED_message_when__if_the_attempt_to_re_attach_fails_the_channel_will_transition_to_the_SUSPENDED_state_and_the_error_will_be_emitted_in_the_ChannelStateChange_event()" time="2.3227630853652954">
        </testcase>
        <testcase classname="RealtimeClientChannelTests" name="test__131__Channel__history__if_the_channel_receives_a_server_initiated_DETACHED_message_when__if_the_channel_was_already_in_the_ATTACHING_state__the_channel_will_transition_to_the_SUSPENDED_state_and_the_error_will_be_emitted_in_the_ChannelStateChange_event()" time="0.38062894344329834">
        </testcase>
        <testcase classname="RealtimeClientChannelTests" name="test__131b__Channel__if_the_channel_receives_a_server_initiated_DETACHED_message_and_if_the_attempt_to_reattach_fails_then_the_channel_will_transition_to_SUSPENDED_state_with_periodic_reattach_with_channelRetryTimeout()" time="12.72270393371582">
        </testcase>
        <testcase classname="RealtimeClientChannelTests" name="test__132__Channel__history__if_the_channel_receives_a_server_initiated_DETACHED_message_when__if_the_connection_is_no_longer_CONNECTED__then_the_automatic_attempts_to_re_attach_the_channel_must_be_cancelled()" time="1.42678701877594">
        </testcase>
        <testcase classname="RealtimeClientChannelTests" name="test__133__Channel__history__Channel_options__setOptions__should_send_an_ATTACH_message_with_params___modes_if_the_channel_is_attached()" time="0.7450779676437378">
        </testcase>
        <testcase classname="RealtimeClientChannelTests" name="test__134__Channel__history__Channel_options__setOptions__should_send_an_ATTACH_message_with_params___modes_if_the_channel_is_attaching()" time="0.44322001934051514">
        </testcase>
        <testcase classname="RealtimeClientChannelTests" name="test__135__Channel__history__Channel_options__setOptions__should_success_immediately_if_channel_is_not_attaching_or_attached()" time="0.005318999290466309">
        </testcase>
        <testcase classname="RealtimeClientChannelTests" name="test__136__Channel__history__Channel_options__setOptions__should_fail_if_the_attach_moves_to_FAILED()" time="0.5819970369338989">
        </testcase>
        <testcase classname="RealtimeClientChannelTests" name="test__137__Channel__history__Channel_options__setOptions__should_fail_if_the_attach_moves_to_DETACHED()" time="0.36003100872039795">
        </testcase>
        <testcase classname="RealtimeClientChannelTests" name="test__138__Channel__crypto__if_configured_for_encryption__channels_encrypt_and_decrypt_messages__data()" time="1.096592903137207">
        </testcase>
        <testcase classname="RealtimeClientChannelTests" name="test__139__message_attributes__if_the_message_does_not_contain_an_id__it_should_be_set_to_protocolMsgId_index()" time="0.39330899715423584">
        </testcase>
        <testcase classname="RealtimeClientChannelTests" name="test__140__ChannelOptions__options_provided_when_instantiating_a_channel_should_be_frozen()" time="0.013406038284301758">
        </testcase>
        <testcase classname="RealtimeClientChannelTests" name="test__141__ChannelOptions__on_ATTACHED_should_decode_flags_into_array_of_channel_modes()" time="0.0017369985580444336">
        </testcase>
        <testcase classname="RealtimeClientChannelTests" name="test__142__publish__with_resultCallback__returns_valid_PublishResult_with_message_serials()" time="0.37029600143432617">
        </testcase>
        <testcase classname="RealtimeClientChannelTests" name="test__200__channel_serial_is_updated_whenever_a_protocol_message_with_either_message_presence_or_attached_actions_is_received_in_a_channel()" time="0.5410330295562744">
        </testcase>
        <testcase classname="RealtimeClientChannelTests" name="test__201__channel_serial_is_cleared_whenever_a_channel_entered_into_detached_suspended_or_failed_state()" time="0.6007330417633057">
        </testcase>
        <testcase classname="RealtimeClientChannelTests" name="test__202__Channel__attach__protocol_message_channelSerial_must_be_set_to_channelSerial_of_the_most_recent_protocol_message_or_omitted_if_no_previous_protocol_message_received()" time="1.0181349515914917">
        </testcase>
        <testcase classname="RealtimeClientChannelTests" name="test__Channel_options__setOptions__shouldUpdateOptionsOfRestChannel()" time="0.30689191818237305">
        </testcase>
        <testcase classname="RealtimeClientChannelTests" name="test_Channel_should_ignore_protocol_messages_with_Object_and_ObjectSync_actions_when_LiveObjects_plugin_not_provided()" time="0.4238849878311157">
        </testcase>
        <testcase classname="RealtimeClientChannelTests" name="test_channelSerial_isUpdatedByObjectProtocolMessage()" time="0.36402904987335205">
        </testcase>
        <testcase classname="RealtimeClientChannelsTests" name="test__001__Channels__should_exist_methods_to_check_if_a_channel_exists_or_iterate_through_the_existing_channels()" time="0.005607008934020996">
        </testcase>
        <testcase classname="RealtimeClientChannelsTests" name="test__002__Channels__get__should_create_a_new_Channel_if_none_exists_or_return_the_existing_one()" time="0.001352071762084961">
        </testcase>
        <testcase classname="RealtimeClientChannelsTests" name="test__003__Channels__get__should_be_possible_to_specify_a_ChannelOptions()" time="0.0022879838943481445">
        </testcase>
        <testcase classname="RealtimeClientChannelsTests" name="test__004__Channels__get__accessing_an_existing_Channel_with_options_should_update_the_options_and_then_return_the_object()" time="0.003031015396118164">
        </testcase>
        <testcase classname="RealtimeClientChannelsTests" name="test__005__Channels__release__should_release_a_channel()" time="1.0779730081558228">
        </testcase>
        <testcase classname="RealtimeClientConnectionTests" name="test__001__Connection__should_connect_automatically()" time="0.30408596992492676">
        </testcase>
        <testcase classname="RealtimeClientConnectionTests" name="test__002__Connection__should_connect_manually()" time="2.4179699420928955">
        </testcase>
        <testcase classname="RealtimeClientConnectionTests" name="test__003__Connection__API_version_param_must_be_included_in_all_connections()" time="0.005658984184265137">
        </testcase>
        <testcase classname="RealtimeClientConnectionTests" name="test__004__Connection__Library_and_version_param__agent__should_include_the__Ably_Agent__header_value()" time="0.29187607765197754">
        </testcase>
        <testcase classname="RealtimeClientConnectionTests" name="test__005__Connection__basic_operations_should_work_simultaneously()" time="0.9675010442733765">
        </testcase>
        <testcase classname="RealtimeClientConnectionTests" name="test__006__Connection__should_have_an_opened_websocket_connection_and_received_a_CONNECTED_ProtocolMessage()" time="0.3136409521102905">
        </testcase>
        <testcase classname="RealtimeClientConnectionTests" name="test__007__Connection__should_make_a_new_connection_with_a_new_transport_instance_if_the_state_is_CLOSING()" time="0.5794390439987183">
        </testcase>
        <testcase classname="RealtimeClientConnectionTests" name="test__008__Connection__it_should_make_sure_that__when_the_CLOSED_ProtocolMessage_arrives_for_the_old_connection__it_doesn_t_affect_the_new_one()" time="0.6349419355392456">
        </testcase>
        <testcase classname="RealtimeClientConnectionTests" name="test__009__Connection__should_enter_FAILED_state_when_API_key_is_invalid()" time="0.2942410707473755">
        </testcase>
        <testcase classname="RealtimeClientConnectionTests" name="test__010__Connection__attributes_within_ConnectionDetails_should_be_used_as_defaults()" time="0.28588199615478516">
        </testcase>
        <testcase classname="RealtimeClientConnectionTests" name="test__011__Connection__should_disconnect_the_transport_when_no_activity_exist()" time="5.0939249992370605">
        </testcase>
        <testcase classname="RealtimeClientConnectionTests" name="test__012__Connection__the_client_may_receive_a_CONNECTED_ProtocolMessage_from_Ably_at_any_point_and_should_emit_an_UPDATE_event()" time="0.8324680328369141">
        </testcase>
        <testcase classname="RealtimeClientConnectionTests" name="test__013__Connection__should_set_the_Connection_reason_attribute_based_on_the_Error_member_of_the_CONNECTED_ProtocolMessage()" time="0.4899660348892212">
        </testcase>
        <testcase classname="RealtimeClientConnectionTests" name="test__014__Connection__should_not_move_to_FAILED_if_received_DISCONNECT_with_an_error()" time="0.31505393981933594">
        </testcase>
        <testcase classname="RealtimeClientConnectionTests" name="test__015__Connection__should_abort_reconnection_with_new_token_if_the_server_has_requested_it_to_authorize_and_after_it_the_connection_has_been_closed()" time="0.36091697216033936">
        </testcase>
        <testcase classname="RealtimeClientConnectionTests" name="test__016__Connection__ConnectionDetails__maxMessageSize_overrides_the_default_maxMessageSize()" time="0.29019594192504883">
        </testcase>
        <testcase classname="RealtimeClientConnectionTests" name="test__017__Connection__url__should_connect_to_the_default_host()" time="0.0015109777450561523">
        </testcase>
        <testcase classname="RealtimeClientConnectionTests" name="test__018__Connection__url__should_connect_with_query_string_params()" time="0.3069499731063843">
        </testcase>
        <testcase classname="RealtimeClientConnectionTests" name="test__019__Connection__url__should_connect_with_query_string_params_including_clientId()" time="0.4988819360733032">
        </testcase>
        <testcase classname="RealtimeClientConnectionTests" name="test__020__Connection__event_emitter__should_emit_events_for_state_changes()" time="1.0797829627990723">
        </testcase>
        <testcase classname="RealtimeClientConnectionTests" name="test__021__Connection__event_emitter__should_never_emit_a_ConnectionState_event_for_a_state_equal_to_the_previous_state()" time="0.5880470275878906">
        </testcase>
        <testcase classname="RealtimeClientConnectionTests" name="test__021b__Connection__event_emitter__should_never_emit_a_ConnectionState_event_for_a_state_equal_to_the_previous_state_CONNECTING()" time="0.2970860004425049">
        </testcase>
        <testcase classname="RealtimeClientConnectionTests" name="test__022__Connection__event_emitter__should_emit_states_on_a_new_connection()" time="0.2967320680618286">
        </testcase>
        <testcase classname="RealtimeClientConnectionTests" name="test__023__Connection__event_emitter__should_emit_states_when_connection_is_closed()" time="0.3823150396347046">
        </testcase>
        <testcase classname="RealtimeClientConnectionTests" name="test__024__Connection__event_emitter__should_have_the_current_state()" time="0.29457199573516846">
        </testcase>
        <testcase classname="RealtimeClientConnectionTests" name="test__025__Connection__event_emitter__should_have_a_ConnectionStateChange_as_first_argument_for_every_connection_state_change()" time="0.3025209903717041">
        </testcase>
        <testcase classname="RealtimeClientConnectionTests" name="test__026__Connection__event_emitter__should_have_the_reason_which_contains_an_ErrorInfo()" time="0.2933990955352783">
        </testcase>
        <testcase classname="RealtimeClientConnectionTests" name="test__027__Connection__event_emitter__any_state_change_triggered_by_a_ProtocolMessage_that_contains_an_Error_member_should_populate_the_Reason_property()" time="0.47492802143096924">
        </testcase>
        <testcase classname="RealtimeClientConnectionTests" name="test__028__Connection__ACK_and_NACK__should_expect_either_an_ACK_or_NACK_to_confirm__successful_receipt_and_acceptance_of_message()" time="0.4595649242401123">
        </testcase>
        <testcase classname="RealtimeClientConnectionTests" name="test__029__Connection__ACK_and_NACK__should_expect_either_an_ACK_or_NACK_to_confirm__successful_receipt_and_acceptance_of_presence()" time="0.45234501361846924">
        </testcase>
        <testcase classname="RealtimeClientConnectionTests" name="test__030__Connection__ACK_and_NACK__should_expect_either_an_ACK_or_NACK_to_confirm__message_failure()" time="0.7865509986877441">
        </testcase>
        <testcase classname="RealtimeClientConnectionTests" name="test__031__Connection__ACK_and_NACK__should_expect_either_an_ACK_or_NACK_to_confirm__presence_failure()" time="0.4603259563446045">
        </testcase>
        <testcase classname="RealtimeClientConnectionTests" name="test__032__Connection__ACK_and_NACK__ProtocolMessage__should_contain_unique_serially_incrementing_msgSerial_along_with_the_count()" time="1.0244789123535156">
        </testcase>
        <testcase classname="RealtimeClientConnectionTests" name="test__033__Connection__ACK_and_NACK__ProtocolMessage__should_continue_incrementing_msgSerial_serially_if_the_connection_resumes_successfully()" time="5.511681079864502">
        </testcase>
        <testcase classname="RealtimeClientConnectionTests" name="test__034__Connection__ACK_and_NACK__ProtocolMessage__should_reset_msgSerial_serially_if_the_connection_does_not_resume()" time="1.5002940893173218">
        </testcase>
        <testcase classname="RealtimeClientConnectionTests" name="test__035__Connection__ACK_and_NACK__should_trigger_the_failure_callback_for_the_remaining_pending_messages_if__connection_is_closed()" time="2.5792429447174072">
        </testcase>
        <testcase classname="RealtimeClientConnectionTests" name="test__036__Connection__ACK_and_NACK__should_trigger_the_failure_callback_for_the_remaining_pending_messages_if__connection_state_enters_FAILED()" time="1.4420759677886963">
        </testcase>
        <testcase classname="RealtimeClientConnectionTests" name="test__038__Connection__connection_id__should_be_null_until_connected()" time="0.3030049800872803">
        </testcase>
        <testcase classname="RealtimeClientConnectionTests" name="test__039__Connection__connection_id__should_have_unique_IDs()" time="0.47557199001312256">
        </testcase>
        <testcase classname="RealtimeClientConnectionTests" name="test__040__Connection__connection_key__should_be_null_until_connected()" time="0.30188095569610596">
        </testcase>
        <testcase classname="RealtimeClientConnectionTests" name="test__041__Connection__connection_key__should_have_unique_connection_keys()" time="0.4877009391784668">
        </testcase>
        <testcase classname="RealtimeClientConnectionTests" name="test__045__Connection__close__if_CONNECTING__do_the_operation_once_CONNECTED()" time="0.4097329378128052">
        </testcase>
        <testcase classname="RealtimeClientConnectionTests" name="test__046__Connection__close__if_CONNECTED__should_send_a_CLOSE_action__change_state_to_CLOSING_and_receive_a_CLOSED_action()" time="0.3711949586868286">
        </testcase>
        <testcase classname="RealtimeClientConnectionTests" name="test__047__Connection__close__should_transition_to_CLOSED_action_when_the_close_process_timeouts()" time="0.4282630681991577">
        </testcase>
        <testcase classname="RealtimeClientConnectionTests" name="test__048__Connection__close__transitions_to_the_CLOSING_state_and_then_to_the_CLOSED_state_if_the_transport_is_abruptly_closed()" time="0.4080110788345337">
        </testcase>
        <testcase classname="RealtimeClientConnectionTests" name="test__049__Connection__close__if_DISCONNECTED__aborts_the_retry_and_moves_immediately_to_CLOSED()" time="1.8992849588394165">
        </testcase>
        <testcase classname="RealtimeClientConnectionTests" name="test__050__Connection__close__if_SUSPENDED__aborts_the_retry_and_moves_immediately_to_CLOSED()" time="1.9191070795059204">
        </testcase>
        <testcase classname="RealtimeClientConnectionTests" name="test__051__Connection__ping__fails_if_in_the_INITIALIZED__SUSPENDED__CLOSING__CLOSED_or_FAILED_state()" time="0.8624540567398071">
        </testcase>
        <testcase classname="RealtimeClientConnectionTests" name="test__052__Connection__ping__should_send_a_ProtocolMessage_with_action_HEARTBEAT_and_expects_a_HEARTBEAT_message_in_response()" time="0.4401179552078247">
        </testcase>
        <testcase classname="RealtimeClientConnectionTests" name="test__053__Connection__ping__should_fail_if_a_HEARTBEAT_ProtocolMessage_is_not_received_within_the_default_realtime_request_timeout()" time="3.5399999618530273">
        </testcase>
        <testcase classname="RealtimeClientConnectionTests" name="test__054__Connection__connection_request_fails__on_DISCONNECTED_after_CONNECTED__should_not_emit_error_with_a_renewable_token()" time="2.8634179830551147">
        </testcase>
        <testcase classname="RealtimeClientConnectionTests" name="test__055__Connection__connection_request_fails__on_token_error_while_CONNECTING__reissues_token_and_reconnects()" time="5.254461050033569">
        </testcase>
        <testcase classname="RealtimeClientConnectionTests" name="test__056__Connection__connection_request_fails__should_transition_to_disconnected_when_the_token_renewal_fails()" time="2.3685319423675537">
        </testcase>
        <testcase classname="RealtimeClientConnectionTests" name="test__057__Connection__connection_request_fails__should_transition_to_Failed_state_because_the_token_is_invalid_and_not_renewable()" time="3.6881519556045532">
        </testcase>
        <testcase classname="RealtimeClientConnectionTests" name="test__058__Connection__connection_request_fails__connection_attempt_should_fail_if_not_connected_within_the_default_realtime_request_timeout()" time="0.5270379781723022">
        </testcase>
        <testcase classname="RealtimeClientConnectionTests" name="test__059__Connection__connection_request_fails__connection_attempt_fails_for_any_recoverable_reason__for_example_a_timeout()" time="13.899103045463562">
        </testcase>
        <testcase classname="RealtimeClientConnectionTests" name="test__059b__Connection__connection_request_fails__connection_attempt_fails_for_any_recoverable_reason__for_example_an_hostUnreachable_transport_error()" time="19.519742012023926">
        </testcase>
        <testcase classname="RealtimeClientConnectionTests" name="test__060__Connection__connection_request_fails__connection_state_has_been_in_the_DISCONNECTED_state_for_more_than_the_default_connectionStateTtl_should_change_the_state_to_SUSPENDED()" time="1.0906260013580322">
        </testcase>
        <testcase classname="RealtimeClientConnectionTests" name="test__061__Connection__connection_request_fails__should_change_the_state_to_SUSPENDED_when_the_connection_state_has_been_in_the_DISCONNECTED_state_for_more_than_the_connectionStateTtl()" time="13.133036017417908">
        </testcase>
        <testcase classname="RealtimeClientConnectionTests" name="test__062__Connection__connection_request_fails__on_CLOSE_the_connection_should_stop_connection_retries()" time="3.781501054763794">
        </testcase>
        <testcase classname="RealtimeClientConnectionTests" name="test__064__Connection__connection_failures_once_CONNECTED__if_a_Connection_transport_is_disconnected_unexpectedly_or_if_a_token_expires__then_the_Connection_manager_will_immediately_attempt_to_reconnect()" time="1.7844020128250122">
        </testcase>
        <testcase classname="RealtimeClientConnectionTests" name="test__065__Connection__connection_failures_once_CONNECTED__should_recover_from_disconnection_and_messages_should_be_delivered_once_the_connection_is_resumed()" time="0.8737590312957764">
        </testcase>
        <testcase classname="RealtimeClientConnectionTests" name="test__066__Connection__connection_failures_once_CONNECTED__ACK_and_NACK_responses_for_published_messages_can_only_ever_be_received_on_the_transport_connection_on_which_those_messages_were_sent()" time="0.7608819007873535">
        </testcase>
        <testcase classname="RealtimeClientConnectionTests" name="test__067__Connection__connection_failures_once_CONNECTED__reconnects_to_the_websocket_endpoint_with_additional_querystring_params__resume_is_the_private_connection_key_from_the_most_recent_CONNECTED_ProtocolMessage_received()" time="0.7052750587463379">
        </testcase>
        <testcase classname="RealtimeClientConnectionTests" name="test__068a__Connection__connection_failures_once_CONNECTED__System_s_response_to_a_resume_request__CONNECTED_ProtocolMessage_with_the_same_connectionId_as_the_current_client__and_no_error()" time="0.7078800201416016">
        </testcase>
        <testcase classname="RealtimeClientConnectionTests" name="test__068b__Connection__connection_failures_once_CONNECTED__System_s_response_to_a_resume_request__CONNECTED_ProtocolMessage_with_the_same_connectionId_as_the_current_client__and_no_error()" time="0.8782129287719727">
        </testcase>
        <testcase classname="RealtimeClientConnectionTests" name="test__068c__Connection__connection_failures_once_CONNECTED__System_s_response_to_a_resume_request__CONNECTED_ProtocolMessage_with_the_same_connectionId_as_the_current_client__and_no_error()" time="10.781985998153687">
        </testcase>
        <testcase classname="RealtimeClientConnectionTests" name="test__069__Connection__connection_failures_once_CONNECTED__System_s_response_to_a_resume_request__CONNECTED_ProtocolMessage_with_the_different_connectionId_than_the_current_client_and_an_non_fatal_error()" time="0.761367917060852">
        </testcase>
        <testcase classname="RealtimeClientConnectionTests" name="test__071__Connection__connection_failures_once_CONNECTED__System_s_response_to_a_resume_request__ERROR_ProtocolMessage_indicating_a_fatal_error_in_the_connection()" time="0.4079890251159668">
        </testcase>
        <testcase classname="RealtimeClientConnectionTests" name="test__072__Connection__connection_failures_once_CONNECTED__System_s_response_to_a_resume_request__should_resume_the_connection_after_an_auth_renewal()" time="5.024984955787659">
        </testcase>
        <testcase classname="RealtimeClientConnectionTests" name="test__073__Connection__connection_failures_once_CONNECTED__when_a_connection_is_resumed__the_connection_key_may_change_and_will_be_provided_in_the_first_CONNECTED_ProtocolMessage_connectionDetails()" time="0.7696399688720703">
        </testcase>
        <testcase classname="RealtimeClientConnectionTests" name="test__074__Connection__connection_failures_once_CONNECTED__when_connection__ttl_plus_idle_interval__period_has_passed_since_last_activity__uses_a_new_connection()" time="6.178562045097351">
        </testcase>
        <testcase classname="RealtimeClientConnectionTests" name="test__075__Connection__connection_failures_once_CONNECTED__when_connection__ttl_plus_idle_interval__period_has_passed_since_last_activity__reattaches_to_the_same_channels_after_a_new_connection_has_been_established()" time="6.259079933166504">
        </testcase>
        <testcase classname="RealtimeClientConnectionTests" name="test__076__Connection__connection_failures_once_CONNECTED__when_connection__ttl_plus_idle_interval__period_has_NOT_passed_since_last_activity__uses_the_same_connection()" time="0.7126920223236084">
        </testcase>
        <testcase classname="RealtimeClientConnectionTests" name="test__077__Connection__connection_failures_once_CONNECTED__DISCONNECTED_message_contains_a_token_error__if_the_token_is_renewable_then_error_should_not_be_emitted()" time="1.8978469371795654">
        </testcase>
        <testcase classname="RealtimeClientConnectionTests" name="test__078__Connection__connection_failures_once_CONNECTED__DISCONNECTED_message_contains_a_token_error__and_the_library_does_not_have_a_means_to_renew_the_token__the_connection_will_transition_to_the_FAILED_state()" time="2.36195707321167">
        </testcase>
        <testcase classname="RealtimeClientConnectionTests" name="test__079__Connection__connection_failures_once_CONNECTED__DISCONNECTED_message_contains_a_token_error__should_transition_to_disconnected_when_the_token_renewal_fails_and_the_error_should_be_emitted()" time="2.820405960083008">
        </testcase>
        <testcase classname="RealtimeClientConnectionTests" name="test__080__Connection__Connection_recovery__connection_state_should_recover_explicitly_with_a_recover_key()" time="1.345663070678711">
        </testcase>
        <testcase classname="RealtimeClientConnectionTests" name="test__082__Connection__Connection_recovery__when_a_connection_is_successfully_recovered__Connection_id_will_be_identical_to_the_id_of_the_connection_that_was_recovered_and_Connection_key_will_always_be_updated_to_the_ConnectionDetails_connectionKey_provided_in_the_first_CONNECTED_ProtocolMessage()" time="0.5766489505767822">
        </testcase>
        <testcase classname="RealtimeClientConnectionTests" name="test__085__Connection__Connection_recovery__should_set_internal_message_serial_to_component_in_recovery_key()" time="0.4526010751724243">
        </testcase>
        <testcase classname="RealtimeClientConnectionTests" name="test__086__Connection__Connection_recovery__library_should_create_channel_with_corresponding_serial_in_given_recovery_key()" time="0.7405819892883301">
        </testcase>
        <testcase classname="RealtimeClientConnectionTests" name="test__086a__Connection__Host_Fallback__failing_connections_with_custom_endpoint_should_result_in_an_error_immediately()" time="0.11208701133728027">
        </testcase>
        <testcase classname="RealtimeClientConnectionTests" name="test__086b__Connection__Host_Fallback__failing_connections_with_custom_port_should_result_in_an_error_immediately()" time="0.10884296894073486">
        </testcase>
        <testcase classname="RealtimeClientConnectionTests" name="test__086c__Connection__Host_Fallback__failing_connections_with_custom_tlsPort_should_result_in_an_error_immediately()" time="0.10950303077697754">
        </testcase>
        <testcase classname="RealtimeClientConnectionTests" name="test__087__Connection__Host_Fallback__failing_connections_with_custom_endpoint_should_result_in_time_outs()" time="0.10715901851654053">
        </testcase>
        <testcase classname="RealtimeClientConnectionTests" name="test__089__Connection__Host_Fallback__applies_when_an_array_of_ClientOptions_fallbackHosts_is_provided()" time="1.2264059782028198">
        </testcase>
        <testcase classname="RealtimeClientConnectionTests" name="test__090__Connection__Connection_recovery__library_provides_additional_querystring_when_recover_is_provided()" time="0.7149759531021118">
        </testcase>
        <testcase classname="RealtimeClientConnectionTests" name="test__090__Connection__Host_Fallback__should_not_use_an_alternative_host_when_the_client_receives_a_bad_request()" time="0.9522579908370972">
        </testcase>
        <testcase classname="RealtimeClientConnectionTests" name="test__091__Connection__Host_Fallback__every_connection_is_first_attempted_to_the_primary_host_default_endpoint()" time="0.3394460678100586">
        </testcase>
        <testcase classname="RealtimeClientConnectionTests" name="test__091__Connection__Host_Fallback__every_connection_is_first_attempted_to_the_primary_host_nonprod_endpoint()" time="0.3273109197616577">
        </testcase>
        <testcase classname="RealtimeClientConnectionTests" name="test__092__Connection__Host_Fallback__should_retry_hosts_in_random_order_after_checkin_if_an_internet_connection_is_available_default_endpoint()" time="1.2376999855041504">
        </testcase>
        <testcase classname="RealtimeClientConnectionTests" name="test__092__Connection__Host_Fallback__should_retry_hosts_in_random_order_after_checkin_if_an_internet_connection_is_available_nonprod_endpoint()" time="1.239454984664917">
        </testcase>
        <testcase classname="RealtimeClientConnectionTests" name="test__093__Connection__Host_Fallback__doesn_t_try_fallback_host_if_Internet_connection_check_fails()" time="0.10940396785736084">
        </testcase>
        <testcase classname="RealtimeClientConnectionTests" name="test__093b__Connection__Host_Fallback__connectivity_check_requests_the_default_URL()" time="0.0020389556884765625">
        </testcase>
        <testcase classname="RealtimeClientConnectionTests" name="test__093c__Connection__Host_Fallback__connectivity_check_requests_ClientOptions_connectivityCheckUrl()" time="0.0017780065536499023">
        </testcase>
        <testcase classname="RealtimeClientConnectionTests" name="test__093d__Connection__Host_Fallback__connectivity_check_fails_unless_the_body_is_yes()" time="0.0009009838104248047">
        </testcase>
        <testcase classname="RealtimeClientConnectionTests" name="test__094__Connection__Host_Fallback__should_retry_custom_fallback_hosts_in_random_order_after_checkin_if_an_internet_connection_is_available()" time="1.2292460203170776">
        </testcase>
        <testcase classname="RealtimeClientConnectionTests" name="test__095__Connection__Host_Fallback__won_t_use_fallback_hosts_feature_if_an_empty_array_is_provided()" time="0.10869598388671875">
        </testcase>
        <testcase classname="RealtimeClientConnectionTests" name="test__096__Connection__Host_Fallback__client_is_connected_to_a_fallback_host_endpoint_should_do_HTTP_requests_to_the_same_data_centre()" time="0.669503927230835">
        </testcase>
        <testcase classname="RealtimeClientConnectionTests" name="test__097__Connection__Host_Fallback__should_use_an_alternative_host_when___hostUnreachable()" time="0.36879992485046387">
        </testcase>
        <testcase classname="RealtimeClientConnectionTests" name="test__098__Connection__Host_Fallback__should_use_an_alternative_host_when___requestTimeout()" time="0.5593199729919434">
        </testcase>
        <testcase classname="RealtimeClientConnectionTests" name="test__099__Connection__Host_Fallback__should_use_an_alternative_host_when___hostInternalError_code__501()" time="0.3673980236053467">
        </testcase>
        <testcase classname="RealtimeClientConnectionTests" name="test__100__Connection__Host_Fallback__should_move_to_disconnected_when_there_s_no_internet__with_NSPOSIXErrorDomain_with_code_57()" time="0.29960405826568604">
        </testcase>
        <testcase classname="RealtimeClientConnectionTests" name="test__101__Connection__Host_Fallback__should_move_to_disconnected_when_there_s_no_internet__with_NSPOSIXErrorDomain_with_code_50()" time="0.2864229679107666">
        </testcase>
        <testcase classname="RealtimeClientConnectionTests" name="test__102__Connection__Host_Fallback__should_move_to_disconnected_when_there_s_no_internet__with_any_kCFErrorDomainCFNetwork()" time="0.29203200340270996">
        </testcase>
        <testcase classname="RealtimeClientConnectionTests" name="test__103a__Connection__Transport_disconnected_side_effects__should_resend_any_ProtocolMessage_by_processing_connection_wide_pending_messages()" time="0.8728280067443848">
        </testcase>
        <testcase classname="RealtimeClientConnectionTests" name="test__103b__Connection__Transport_disconnected_side_effects_message_serial_for_pending_message_must_remain_the_same_that_is_awaiting_a_ACK_NACK()" time="1.4350460767745972">
        </testcase>
        <testcase classname="RealtimeClientConnectionTests" name="test__103c__Connection__Transport_disconnected_side_effects_message_must_be_assigned_a_new_msgSerial_from_the_internal_msgSerial()" time="1.7642760276794434">
        </testcase>
        <testcase classname="RealtimeClientConnectionTests" name="test__104__Connection__Transport_disconnected_side_effects__should_resend_the_ATTACH_message_if_there_are_any_pending_channels()" time="0.8086839914321899">
        </testcase>
        <testcase classname="RealtimeClientConnectionTests" name="test__106__Connection__Operating_System_events_for_network_internet_connectivity_changes__should_immediately_attempt_to_connect_if_the_operating_system-indicates_that_the_underlying_internet_connection_is_now_available_when_DISCONNECTED_or_SUSPENDED()" time="0.28707706928253174">
        </testcase>
        <testcase classname="RealtimeClientConnectionTests" name="test__106_b__Connection__Operating_System_events_for_network_internet_connectivity_changes__should_restart_the_pending_connection_attempt_if_the_operating_system-indicates_that_the_underlying_internet_connection_is_now_available_when_CONNECTING()" time="0.6144499778747559">
        </testcase>
        <testcase classname="RealtimeClientConnectionTests" name="test__107__Connection__Operating_System_events_for_network_internet_connectivity_changes__Ably_can_request_that_a_connected_client_re_authenticates_by_sending_the_client_an_AUTH_ProtocolMessage()" time="0.874629020690918">
        </testcase>
        <testcase classname="RealtimeClientConnectionTests" name="test__108__Connection__Operating_System_events_for_network_internet_connectivity_changes__re_authenticate_and_resume_the_connection_when_the_client_is_forcibly_disconnected_following_a_DISCONNECTED_message_containing_an_error_code_greater_than_or_equal_to_40140_and_less_than_40150()" time="5.012598991394043">
        </testcase>
        <testcase classname="RealtimeClientConnectionTests" name="test__109__Connection__Operating_System_events_for_network_internet_connectivity_changes__should_immediately_change_the_state_to_DISCONNECTED_if_the_operating_system-indicates_that_the_underlying_internet_connection_is_no_longer_available__when_CONNECTING()" time="0.0016050338745117188">
        </testcase>
        <testcase classname="RealtimeClientConnectionTests" name="test__110__Connection__Connection_recovery__connection_recovery_key_is_correctly_constructed_from_defined_parts()" time="0.5718990564346313">
        </testcase>
        <testcase classname="RealtimeClientConnectionTests" name="test__110__Connection__Operating_System_events_for_network_internet_connectivity_changes__should_immediately_change_the_state_to_DISCONNECTED_if_the_operating_system-indicates_that_the_underlying_internet_connection_is_no_longer_available__when_CONNECTED()" time="0.2943000793457031">
        </testcase>
        <testcase classname="RealtimeClientConnectionTests" name="test__111__Connection__Connection_recovery__connection_recovery_key_is_properly_serializing_any_unicode_channel_name()" time="0.6641010046005249">
        </testcase>
        <testcase classname="RealtimeClientConnectionTests" name="test__111__Connection__with_fixture_messages__should_encode_and_decode_fixture_messages_as_expected()" time="6.855705976486206">
        </testcase>
        <testcase classname="RealtimeClientConnectionTests" name="test__112__Connection__Connection_recovery__connection_recovery_key_is_null_when_connection_is_in_invalid_state()" time="0.36678898334503174">
        </testcase>
        <testcase classname="RealtimeClientConnectionTests" name="test__112__Connection__with_fixture_messages__should_send_messages_through_raw_JSON_POST_and_retrieve_equal_messages_through_MsgPack_and_JSON()" time="0.8964239358901978">
        </testcase>
        <testcase classname="RealtimeClientConnectionTests" name="test__113__Connection__Connection_recovery__connection_recovery_key_is_null_when_connection_is_in_suspended_state()" time="0.2932579517364502">
        </testcase>
        <testcase classname="RealtimeClientConnectionTests" name="test__113__Connection__with_fixture_messages__should_send_messages_through_MsgPack_and_JSON_and_retrieve_equal_messages_through_raw_JSON_GET()" time="13.223827004432678">
        </testcase>
        <testcase classname="RealtimeClientConnectionTests" name="test__114__Connection__Connection_recovery__connection_recovery_key_is_null_when_connection_is_in_failed_state()" time="0.3101999759674072">
        </testcase>
        <testcase classname="RealtimeClientConnectionTests" name="test__139__Connection__connection_id_and_key__should_be_nil_when_sdk_is_in_CLOSING_and_CLOSED_states()" time="0.3890780210494995">
        </testcase>
        <testcase classname="RealtimeClientConnectionTests" name="test__140__Connection__connection_id_and_key__should_be_nil_when_sdk_is_in_SUSPENDED_state()" time="0.2927250862121582">
        </testcase>
        <testcase classname="RealtimeClientConnectionTests" name="test__141__Connection__connection_id_and_key__should_be_nil_when_sdk_is_in_FAILED_state()" time="0.3075650930404663">
        </testcase>
        <testcase classname="RealtimeClientConnectionTests" name="test__200a__Connection__Connection_recovery__failures_system-response_to_unrecoverable_token_error()" time="1.4491209983825684">
        </testcase>
        <testcase classname="RealtimeClientConnectionTests" name="test__200b__Connection__Connection_recovery__failures_system-response_to_unrecoverable_token_error()" time="1.2823489904403687">
        </testcase>
        <testcase classname="RealtimeClientConnectionTests" name="test__200c__Connection__Connection_recovery__failures_system-response_to_unrecoverable_token_error()" time="1.307573914527893">
        </testcase>
        <testcase classname="RealtimeClientConnectionTests" name="test__201__Connection__Connection_recovery__failures_once_CONNECTED__System_s_response_to_a_resume_request__CONNECTED_ProtocolMessage_with_the_different_connectionId_than_the_current_client_and_an_non_fatal_error()" time="0.5959620475769043">
        </testcase>
        <testcase classname="RealtimeClientConnectionTests" name="test__202__Connection__Connection_recovery__failures_with_any_other_fatal_error_in_the_connection()" time="0.8061989545822144">
        </testcase>
        <testcase classname="RealtimeClientPresenceTests" name="test__002__Presence__should_receive_all_250_members()" time="125.53772604465485">
        </testcase>
        <testcase classname="RealtimeClientPresenceTests" name="test__003__Presence__should_be_used_a_PresenceMap_to_maintain_a_list_of_members()" time="50.39971399307251">
        </testcase>
        <testcase classname="RealtimeClientPresenceTests" name="test__004__Presence__callback_can_be_provided_that_will_be_called_upon_success()" time="0.4359780550003052">
        </testcase>
        <testcase classname="RealtimeClientPresenceTests" name="test__005__Presence__callback_can_be_provided_that_will_be_called_upon_failure()" time="0.5453330278396606">
        </testcase>
        <testcase classname="RealtimeClientPresenceTests" name="test__006__Presence__should_also_ensure_that_using_updateClient_has_no_side_effects_on_a_client_that_has_entered_normally_using_Presence_enter()" time="0.9651739597320557">
        </testcase>
        <testcase classname="RealtimeClientPresenceTests" name="test__007__Presence__should_indicate_an_error_if_the_client_is_identified_and_has_a_valid_clientId_and_the_clientId_argument_does_not_match_the_client_s_clientId()" time="0.5194320678710938">
        </testcase>
        <testcase classname="RealtimeClientPresenceTests" name="test__008__Presence__Presence_syncComplete_returns_true_if_the_initial_SYNC_operation_has_completed()" time="125.4745260477066">
        </testcase>
        <testcase classname="RealtimeClientPresenceTests" name="test__010__Presence__ProtocolMessage_bit_flag__when_members_are_present()" time="125.54287004470825">
        </testcase>
        <testcase classname="RealtimeClientPresenceTests" name="test__011__Presence__realtime_system-reserves_the_right_to_initiate_a_sync_of_the_presence_members_at_any_point_once_a_channel_is_attached__should_do_a_new_sync_whenever_a_SYNC_ProtocolMessage_is_received_with_a_channel_attribute_and_a_new_sync_sequence_identifier_in_the_channelSerial_attribute()" time="1.0023630857467651">
        </testcase>
        <testcase classname="RealtimeClientPresenceTests" name="test__012__Presence__realtime_system-reserves_the_right_to_initiate_a_sync_of_the_presence_members_at_any_point_once_a_channel_is_attached__when_a_SYNC_is_sent_with_no_channelSerial_attribute_then_the_sync_data_is_entirely_contained_within_that_ProtocolMessage()" time="0.458469033241272">
        </testcase>
        <testcase classname="RealtimeClientPresenceTests" name="test__013__Presence__PresenceMap_has_existing_members_when_a_SYNC_is_started__should_ensure_that_members_no_longer_present_on_the_channel_are_removed_from_the_local_PresenceMap_once_the_sync_is_complete()" time="1.4184249639511108">
        </testcase>
        <testcase classname="RealtimeClientPresenceTests" name="test__014__Presence__PresenceMap_has_existing_members_when_a_SYNC_is_started__should_emit_a_LEAVE_event_for_each_existing_member_if_the_PresenceMap_has_existing_members_when_an_ATTACHED_message_is_received_without_a_HAS_PRESENCE_flag()" time="0.3894709348678589">
        </testcase>
        <testcase classname="RealtimeClientPresenceTests" name="test__015__Presence__subscribe__with_no_arguments_should_subscribe_a_listener_to_all_presence_messages()" time="1.9119369983673096">
        </testcase>
        <testcase classname="RealtimeClientPresenceTests" name="test__016__Presence__unsubscribe__with_no_arguments_unsubscribes_the_listener_if_previously_subscribed_with_an_action_specific_subscription()" time="0.0018739700317382812">
        </testcase>
        <testcase classname="RealtimeClientPresenceTests" name="test__017__Presence__Channel_state_change_side_effects__if_a_channel_enters_the_ATTACHED_state_then_all_queued_presence_messages_will_be_sent_immediately_and_a_presence_SYNC_may_be_initiated()" time="0.8443279266357422">
        </testcase>
        <testcase classname="RealtimeClientPresenceTests" name="test__018__Presence__Channel_state_change_side_effects__if_the_channel_enters_the_FAILED_state__all_queued_presence_messages_should_fail_immediately()" time="0.0027229785919189453">
        </testcase>
        <testcase classname="RealtimeClientPresenceTests" name="test__019__Presence__Channel_state_change_side_effects__if_the_channel_enters_the_FAILED_state__should_clear_the_PresenceMap_including_local_members_and_does_not_emit_any_presence_events()" time="0.4282050132751465">
        </testcase>
        <testcase classname="RealtimeClientPresenceTests" name="test__020__Presence__Channel_state_change_side_effects__if_the_channel_enters_the_DETACHED_state__all_queued_presence_messages_should_fail_immediately()" time="0.005784034729003906">
        </testcase>
        <testcase classname="RealtimeClientPresenceTests" name="test__021__Presence__Channel_state_change_side_effects__if_the_channel_enters_the_DETACHED_state__should_clear_the_PresenceMap_including_local_members_and_does_not_emit_any_presence_events()" time="0.48287296295166016">
        </testcase>
        <testcase classname="RealtimeClientPresenceTests" name="test__022__Presence__Channel_state_change_side_effects__channel_enters_the_SUSPENDED_state__all_queued_presence_messages_should_fail_immediately()" time="0.0019530057907104492">
        </testcase>
        <testcase classname="RealtimeClientPresenceTests" name="test__023__Presence__Channel_state_change_side_effects__channel_enters_the_SUSPENDED_state__members_map_is_preserved_and_only_members_that_changed_between_ATTACHED_states_should_result_in_presence_events()" time="4.276363015174866">
        </testcase>
        <testcase classname="RealtimeClientPresenceTests" name="test__024__Presence__enter__should_enter_the_current_client__optionally_with_the_data_provided()" time="0.5239510536193848">
        </testcase>
        <testcase classname="RealtimeClientPresenceTests" name="test__025__Presence__unsubscribe__with_a_single_action_argument_unsubscribes_the_provided_listener_to_all_presence_messages_for_that_action()" time="0.0018450021743774414">
        </testcase>
        <testcase classname="RealtimeClientPresenceTests" name="test__026__Presence__subscribe__should_implicitly_attach_the_channel_if_options_attachOnSubscribe_is_true()" time="0.648455023765564">
        </testcase>
        <testcase classname="RealtimeClientPresenceTests" name="test__026b__Presence__subscribe__should_not_implicitly_attach_the_channel_if_options_attachOnSubscribe_is_false()" time="1.006282925605774">
        </testcase>
        <testcase classname="RealtimeClientPresenceTests" name="test__027__Presence__subscribe__should_result_in_an_error_if_the_channel_is_in_the_FAILED_state_and_options_attachOnSubscribe_is_true()" time="0.0029239654541015625">
        </testcase>
        <testcase classname="RealtimeClientPresenceTests" name="test__027b__Presence__subscribe__should_not_result_in_an_error_if_the_channel_is_in_the_FAILED_state_and_options_attachOnSubscribe_is_false()" time="1.0692089796066284">
        </testcase>
        <testcase classname="RealtimeClientPresenceTests" name="test__028__Presence__subscribe__should_result_in_an_error_if_the_channel_moves_to_the_FAILED_state()" time="0.004552960395812988">
        </testcase>
        <testcase classname="RealtimeClientPresenceTests" name="test__029__Presence__subscribe__with_a_single_action_argument()" time="1.4579769372940063">
        </testcase>
        <testcase classname="RealtimeClientPresenceTests" name="test__030__Presence__enter__optionally_a_callback_can_be_provided_that_is_called_for_success()" time="0.49841296672821045">
        </testcase>
        <testcase classname="RealtimeClientPresenceTests" name="test__031__Presence__enter__optionally_a_callback_can_be_provided_that_is_called_for_failure()" time="0.45453310012817383">
        </testcase>
        <testcase classname="RealtimeClientPresenceTests" name="test__032__Presence__enter__entering_without_an_explicit_PresenceMessage_clientId_should_implicitly_use_the_clientId_of_the_current_connection()" time="0.5179600715637207">
        </testcase>
        <testcase classname="RealtimeClientPresenceTests" name="test__033__Presence__enter__should_result_in_an_error_immediately_if_the_connection_state_is_connected_and_the_client_is_anonymous()" time="0.30311107635498047">
        </testcase>
        <testcase classname="RealtimeClientPresenceTests" name="test__033__Presence__enter__should_result_in_an_error_immediately_if_the_connection_state_is_connected_and_the_client_is_wildcard()" time="0.31364500522613525">
        </testcase>
        <testcase classname="RealtimeClientPresenceTests" name="test__034__Presence__enter__should_result_in_an_error_immediately_if_the_channel_is_DETACHED()" time="0.41994404792785645">
        </testcase>
        <testcase classname="RealtimeClientPresenceTests" name="test__035__Presence__enter__should_result_in_an_error_immediately_if_the_channel_is_FAILED()" time="0.0020509958267211914">
        </testcase>
        <testcase classname="RealtimeClientPresenceTests" name="test__036__Presence__enter__should_result_in_an_error_if_Ably_service_determines_that_the_client_is_unidentified()" time="0.4499940872192383">
        </testcase>
        <testcase classname="RealtimeClientPresenceTests" name="test__037__Presence__update__should_update_the_data_for_the_present_member_with_a_value()" time="0.5664149522781372">
        </testcase>
        <testcase classname="RealtimeClientPresenceTests" name="test__038__Presence__update__should_update_the_data_for_the_present_member_with_null()" time="0.5083959102630615">
        </testcase>
        <testcase classname="RealtimeClientPresenceTests" name="test__039__Presence__update__should_enter_current_client_into_the_channel_if_the_client_was_not_already_entered()" time="0.4347950220108032">
        </testcase>
        <testcase classname="RealtimeClientPresenceTests" name="test__040__Presence__update__optionally_a_callback_can_be_provided_that_is_called_for_success()" time="0.4336169958114624">
        </testcase>
        <testcase classname="RealtimeClientPresenceTests" name="test__041__Presence__update__optionally_a_callback_can_be_provided_that_is_called_for_failure()" time="0.00247800350189209">
        </testcase>
        <testcase classname="RealtimeClientPresenceTests" name="test__042__Presence__update__update_without_an_explicit_PresenceMessage_clientId_should_implicitly_use_the_clientId_of_the_current_connection()" time="0.9340440034866333">
        </testcase>
        <testcase classname="RealtimeClientPresenceTests" name="test__043__Presence__leave__should_leave_the_current_client_from_the_channel_and_the_data_will_be_updated_with_the_value_provided()" time="0.5165599584579468">
        </testcase>
        <testcase classname="RealtimeClientPresenceTests" name="test__044__Presence__leave__should_leave_the_current_client_with_no_data()" time="0.5464609861373901">
        </testcase>
        <testcase classname="RealtimeClientPresenceTests" name="test__045__Presence__PresenceMap__all_incoming_presence_messages_must_be_compared_for_newness_with_the_matching_member_already_in_the_PresenceMap()" time="0.9532489776611328">
        </testcase>
        <testcase classname="RealtimeClientPresenceTests" name="test__047__Presence__PresenceMap__if_action_of_UPDATE_arrives__it_should_be_added_to_the_presence_map_with_the_action_set_to_PRESENT()" time="0.9503389596939087">
        </testcase>
        <testcase classname="RealtimeClientPresenceTests" name="test__048__Presence__PresenceMap__if_action_of_PRESENT_arrives__it_should_be_added_to_the_presence_map_with_the_action_set_to_PRESENT()" time="0.8211569786071777">
        </testcase>
        <testcase classname="RealtimeClientPresenceTests" name="test__049__Presence__PresenceMap__if_a_SYNC_is_not_in_progress__then_when_a_presence_message_with_an_action_of_LEAVE_arrives__that_memberKey_should_be_deleted_from_the_presence_map__if_present()" time="10.387678980827332">
        </testcase>
        <testcase classname="RealtimeClientPresenceTests" name="test__050__Presence__PresenceMap__if_a_SYNC_is_in_progress__then_when_a_presence_message_with_an_action_of_LEAVE_arrives__it_should_be_stored_in_the_presence_map_with_the_action_set_to_ABSENT()" time="10.335965037345886">
        </testcase>
        <testcase classname="RealtimeClientPresenceTests" name="test__051__Presence__PresenceMap__any_incoming_presence_message_that_passes_the_newness_check_should_be_emitted_on_the_Presence_object__with_an_event_name_set_to_its_original_action()" time="0.4431569576263428">
        </testcase>
        <testcase classname="RealtimeClientPresenceTests" name="test__052__Presence__PresenceMap__compare_for_newness__split_the_id_of_both_presence_messages()" time="50.878161907196045">
        </testcase>
        <testcase classname="RealtimeClientPresenceTests" name="test__053__Presence__PresenceMap__compare_for_newness__presence_message_has_a_connectionId_which_is_not_an_initial_substring_of_its_id__compares_them_by_timestamp_numerically()" time="50.90004599094391">
        </testcase>
        <testcase classname="RealtimeClientPresenceTests" name="test__054__Presence__PresenceMap__all_presence_messages_from_a_SYNC_must_also_be_compared_for_newness_in_the_same_way_as_they_would_from_a_PRESENCE__discard_members_where_messages_have_arrived_before_the_SYNC()" time="10.392300009727478">
        </testcase>
        <testcase classname="RealtimeClientPresenceTests" name="test__056__Presence__enter__should_result_in_an_error_if_the_client_does_not_have_required_presence_permission()" time="0.6030130386352539">
        </testcase>
        <testcase classname="RealtimeClientPresenceTests" name="test__057__Presence__update__should_result_in_an_error_immediately_if_the_client_is_anonymous()" time="0.46737897396087646">
        </testcase>
        <testcase classname="RealtimeClientPresenceTests" name="test__058__Presence__update__should_result_in_an_error_immediately_if_the_channel_is_DETACHED()" time="0.45261096954345703">
        </testcase>
        <testcase classname="RealtimeClientPresenceTests" name="test__059__Presence__update__should_result_in_an_error_immediately_if_the_channel_is_FAILED()" time="0.0044280290603637695">
        </testcase>
        <testcase classname="RealtimeClientPresenceTests" name="test__060__Presence__update__should_result_in_an_error_if_the_client_does_not_have_required_presence_permission()" time="0.5658299922943115">
        </testcase>
        <testcase classname="RealtimeClientPresenceTests" name="test__061__Presence__update__should_result_in_an_error_if_Ably_service_determines_that_the_client_is_unidentified()" time="0.4440159797668457">
        </testcase>
        <testcase classname="RealtimeClientPresenceTests" name="test__062__Presence__leave__optionally_a_callback_can_be_provided_that_is_called_for_success()" time="0.950403094291687">
        </testcase>
        <testcase classname="RealtimeClientPresenceTests" name="test__063__Presence__leave__optionally_a_callback_can_be_provided_that_is_called_for_failure()" time="0.4863020181655884">
        </testcase>
        <testcase classname="RealtimeClientPresenceTests" name="test__064__Presence__leave__should_raise_an_error_if_client_is_not_present()" time="0.41786301136016846">
        </testcase>
        <testcase classname="RealtimeClientPresenceTests" name="test__065__Presence__leave__entering_without_an_explicit_PresenceMessage_clientId_should_implicitly_use_the_clientId_of_the_current_connection()" time="0.9533169269561768">
        </testcase>
        <testcase classname="RealtimeClientPresenceTests" name="test__066__Presence__leave__if_the_client_is_not_currently_ENTERED__Ably_will_respond_with_an_ACK_and_the_request_will_succeed()" time="1.9288480281829834">
        </testcase>
        <testcase classname="RealtimeClientPresenceTests" name="test__067__Presence__enter__implicitly_attaches_the_Channel()" time="0.4257509708404541">
        </testcase>
        <testcase classname="RealtimeClientPresenceTests" name="test__068__Presence__enter__should_result_in_an_error_if_the_channel_is_in_the_FAILED_state()" time="0.0022579431533813477">
        </testcase>
        <testcase classname="RealtimeClientPresenceTests" name="test__069__Presence__enter__should_result_in_an_error_if_the_channel_is_in_the_DETACHED_state()" time="0.42930305004119873">
        </testcase>
        <testcase classname="RealtimeClientPresenceTests" name="test__070__Presence__leave__should_result_in_an_error_immediately_if_the_client_is_anonymous()" time="0.42687904834747314">
        </testcase>
        <testcase classname="RealtimeClientPresenceTests" name="test__071__Presence__leave__should_result_in_an_error_immediately_if_the_channel_is_DETACHED()" time="0.46314191818237305">
        </testcase>
        <testcase classname="RealtimeClientPresenceTests" name="test__072__Presence__leave__should_result_in_an_error_immediately_if_the_channel_is_FAILED()" time="0.4202549457550049">
        </testcase>
        <testcase classname="RealtimeClientPresenceTests" name="test__073__Presence__leave__should_result_in_an_error_if_the_client_does_not_have_required_presence_permission()" time="0.5726079940795898">
        </testcase>
        <testcase classname="RealtimeClientPresenceTests" name="test__074__Presence__leave__should_result_in_an_error_if_Ably_service_determines_that_the_client_is_unidentified()" time="0.43792104721069336">
        </testcase>
        <testcase classname="RealtimeClientPresenceTests" name="test__078__Presence__enter__optional_data_can_be_included_when_entering_a_channel()" time="0.8919090032577515">
        </testcase>
        <testcase classname="RealtimeClientPresenceTests" name="test__079__Presence__enter__should_emit_the_data_attribute_in_the_LEAVE_event_when_data_is_provided_when_entering_but_no_data_is_provided_when_leaving()" time="0.9859440326690674">
        </testcase>
        <testcase classname="RealtimeClientPresenceTests" name="test__080__Presence__private_and_internal_PresenceMap_containing_only_members_that_match_the_current_connectionId__any_ENTER__PRESENT__UPDATE_or_LEAVE_event_that_matches_the_current_connectionId_should_be_applied_to_this_object()" time="0.6731300354003906">
        </testcase>
        <testcase classname="RealtimeClientPresenceTests" name="test__081__Presence__private_and_internal_PresenceMap_containing_only_members_that_match_the_current_connectionId__all_members_belonging_to_the_current_connection_are_published_as_a_PresenceMessage_on_the_Channel_by_the_server_irrespective_of_whether_the_client_has_permission_to_subscribe_or_the_Channel_is_configured_to_publish_presence_events()" time="0.8257910013198853">
        </testcase>
        <testcase classname="RealtimeClientPresenceTests" name="test__084__Presence__enterClient__should_implicitly_attach_the_Channel()" time="0.47579801082611084">
        </testcase>
        <testcase classname="RealtimeClientPresenceTests" name="test__085__Presence__enterClient__should_result_in_an_error_if_the_channel_is_in_the_FAILED_state()" time="0.00295102596282959">
        </testcase>
        <testcase classname="RealtimeClientPresenceTests" name="test__086__Presence__enterClient__should_result_in_an_error_if_the_channel_moves_to_the_FAILED_state()" time="0.0075190067291259766">
        </testcase>
        <testcase classname="RealtimeClientPresenceTests" name="test__087__Presence__updateClient__should_implicitly_attach_the_Channel()" time="0.495074987411499">
        </testcase>
        <testcase classname="RealtimeClientPresenceTests" name="test__088__Presence__updateClient__should_result_in_an_error_if_the_channel_is_in_the_FAILED_state()" time="0.038345932960510254">
        </testcase>
        <testcase classname="RealtimeClientPresenceTests" name="test__089__Presence__updateClient__should_result_in_an_error_if_the_channel_moves_to_the_FAILED_state()" time="0.03527200222015381">
        </testcase>
        <testcase classname="RealtimeClientPresenceTests" name="test__090__Presence__leaveClient__should_implicitly_attach_the_Channel()" time="0.45261991024017334">
        </testcase>
        <testcase classname="RealtimeClientPresenceTests" name="test__091__Presence__leaveClient__should_result_in_an_error_if_the_channel_is_in_the_FAILED_state()" time="0.00506591796875">
        </testcase>
        <testcase classname="RealtimeClientPresenceTests" name="test__092__Presence__leaveClient__should_result_in_an_error_if_the_channel_moves_to_the_FAILED_state()" time="0.003168940544128418">
        </testcase>
        <testcase classname="RealtimeClientPresenceTests" name="test__093__Presence__Connection_state_conditions__all_presence_messages_are_published_immediately_if_the_connection_is_CONNECTED()" time="0.46723806858062744">
        </testcase>
        <testcase classname="RealtimeClientPresenceTests" name="test__094__Presence__Connection_state_conditions__all_presence_messages_will_be_queued_and_delivered_as_soon_as_the_connection_state_returns_to_CONNECTED()" time="0.9164589643478394">
        </testcase>
        <testcase classname="RealtimeClientPresenceTests" name="test__095__Presence__Connection_state_conditions__all_presence_messages_will_be_lost_if_queueMessages_has_been_explicitly_set_to_false()" time="0.37573397159576416">
        </testcase>
        <testcase classname="RealtimeClientPresenceTests" name="test__096__Presence__Connection_state_conditions__should_result_in_an_error_if_the_connection_state_is_INITIALIZED_and_queueMessages_has_been_explicitly_set_to_false()" time="0.0014499425888061523">
        </testcase>
        <testcase classname="RealtimeClientPresenceTests" name="test__097__Presence__Connection_state_conditions__should_result_in_an_error_if_the_connection_state_is__suspended()" time="0.37388503551483154">
        </testcase>
        <testcase classname="RealtimeClientPresenceTests" name="test__098__Presence__Connection_state_conditions__should_result_in_an_error_if_the_connection_state_is__closed()" time="0.44756996631622314">
        </testcase>
        <testcase classname="RealtimeClientPresenceTests" name="test__099__Presence__Connection_state_conditions__should_result_in_an_error_if_the_connection_state_is__failed()" time="0.3639589548110962">
        </testcase>
        <testcase classname="RealtimeClientPresenceTests" name="test__100__Presence__get__should_return_a_list_of_current_members_on_the_channel()" time="75.91136300563812">
        </testcase>
        <testcase classname="RealtimeClientPresenceTests" name="test__101__Presence__get__should_implicitly_attach_the_channel()" time="0.43443095684051514">
        </testcase>
        <testcase classname="RealtimeClientPresenceTests" name="test__102__Presence__get__should_result_in_an_error_if_the_channel_is_in_the_FAILED_state()" time="0.0020040273666381836">
        </testcase>
        <testcase classname="RealtimeClientPresenceTests" name="test__103__Presence__get__should_result_in_an_error_if_the_channel_moves_to_the_FAILED_state()" time="0.0023850202560424805">
        </testcase>
        <testcase classname="RealtimeClientPresenceTests" name="test__104__Presence__get__should_result_in_an_error_if_the_channel_is_in_the_DETACHED_state()" time="0.45838308334350586">
        </testcase>
        <testcase classname="RealtimeClientPresenceTests" name="test__105__Presence__get__should_result_in_an_error_if_the_channel_moves_to_the_DETACHED_state()" time="60.15161895751953">
        </testcase>
        <testcase classname="RealtimeClientPresenceTests" name="test__106__Presence__get__query__waitForSync_should_be_true_by_default()" time="0.0006260871887207031">
        </testcase>
        <testcase classname="RealtimeClientPresenceTests" name="test__107__Presence__get__If_the_Channel_is_in_the_SUSPENDED_state_then__by_default__results_in_an_error()" time="0.0024830102920532227">
        </testcase>
        <testcase classname="RealtimeClientPresenceTests" name="test__108__Presence__get__If_the_Channel_is_in_the_SUSPENDED_state_then__if_waitForSync_is_true__results_in_an_error()" time="0.0022330284118652344">
        </testcase>
        <testcase classname="RealtimeClientPresenceTests" name="test__109__Presence__get__If_the_Channel_is_in_the_SUSPENDED_state_then__if_waitForSync_is_false__returns_the_members_in_the_current_PresenceMap()" time="0.014737963676452637">
        </testcase>
        <testcase classname="RealtimeClientPresenceTests" name="test__110__Presence__get__Query__set_of_params___waitForSync_is_true__should_wait_until_SYNC_is_complete_before_returning_a_list_of_members()" time="75.62511801719666">
        </testcase>
        <testcase classname="RealtimeClientPresenceTests" name="test__111__Presence__get__Query__set_of_params___waitForSync_is_false__should_return_immediately_the_known_set_of_presence_members()" time="75.43253195285797">
        </testcase>
        <testcase classname="RealtimeClientPresenceTests" name="test__112__Presence__get__Query__set_of_params___should_return_members_filtered_by_clientId()" time="0.4541130065917969">
        </testcase>
        <testcase classname="RealtimeClientPresenceTests" name="test__113__Presence__get__Query__set_of_params___should_return_members_filtered_by_connectionId()" time="50.91981899738312">
        </testcase>
        <testcase classname="RealtimeClientPresenceTests" name="test__114__Presence__history__should_support_all_the_same_params_as_Rest()" time="0.5066189765930176">
        </testcase>
        <testcase classname="RealtimeClientPresenceTests" name="test__115__Presence__history__should_return_a_PaginatedResult_page()" time="75.7696760892868">
        </testcase>
        <testcase classname="RealtimeClientPresenceTests" name="test__116__Presence__enterClient__enters_into_presence_on_a_channel_on_behalf_of_another_clientId()" time="0.57368004322052">
        </testcase>
        <testcase classname="RealtimeClientPresenceTests" name="test__117__Presence__enterClient__should_be_present_all_the_registered_members_on_a_presence_channel()" time="0.9400969743728638">
        </testcase>
        <testcase classname="RealtimeClientPresenceTests" name="test__118__Presence__presence_message_attributes__if_the_presence_message_does_not_contain_an_id__it_should_be_set_to_protocolMsgId_index()" time="0.2940870523452759">
        </testcase>
        <testcase classname="RealtimeClientPresenceTests" name="test__119__Presence__presence_message_attributes__extras_should_be_populated_from_user_claims_in_JWT()" time="0.9321780204772949">
        </testcase>
        <testcase classname="RealtimeClientPresenceTests" name="test__200__Presence__PresenceMap_should_perform_re_entry_whenever_a_channel_moves_into_the_attached_state_and_presence_message_consists_of_enter_action_with_client_id_and_data()" time="1.3869280815124512">
        </testcase>
        <testcase classname="RealtimeClientPresenceTests" name="test__201__Presence__history__untilAttach_on_a_channel_that_is_not_attached_should_call_back_with_an_error()" time="0.003076910972595215">
        </testcase>
        <testcase classname="RealtimeClientTests" name="test__001__RealtimeClient__All_WebSocket_connections_should_include_the_current_API_version()" time="0.39892804622650146">
        </testcase>
        <testcase classname="RealtimeClientTests" name="test__002__RealtimeClient__should_have_access_to_the_underlying_Connection_object()" time="0.004516005516052246">
        </testcase>
        <testcase classname="RealtimeClientTests" name="test__003__RealtimeClient__should_provide_access_to_the_underlying_Channels_object()" time="0.0011069774627685547">
        </testcase>
        <testcase classname="RealtimeClientTests" name="test__004__RealtimeClient__should_use_the_configured_timeouts_specified()" time="6.699790954589844">
        </testcase>
        <testcase classname="RealtimeClientTests" name="test__005__RealtimeClient__background_behaviour()" time="1.2533210515975952">
        </testcase>
        <testcase classname="RealtimeClientTests" name="test__006__RealtimeClient__should_accept_acks_with_different_order()" time="0.44058001041412354">
        </testcase>
        <testcase classname="RealtimeClientTests" name="test__007__RealtimeClient__transport_should_guarantee_the_incoming_message_order()" time="0.3000730276107788">
        </testcase>
        <testcase classname="RealtimeClientTests" name="test__008__RealtimeClient__subscriber_should_receive_messages_in_the_same_order_in_which_they_have_been_sent()" time="0.5583920478820801">
        </testcase>
        <testcase classname="RealtimeClientTests" name="test__009__RealtimeClient__should_dispatch_in_user_queue_when_removing_an_observer()" time="0.006678938865661621">
        </testcase>
        <testcase classname="RealtimeClientTests" name="test__010__RealtimeClient__should_never_register_any_connection_listeners_for_internal_use_with_the_public_EventEmitter()" time="0.3868468999862671">
        </testcase>
        <testcase classname="RealtimeClientTests" name="test__011__RealtimeClient__should_never_register_any_message_and_channel_listeners_for_internal_use_with_the_public_EventEmitter()" time="0.7893270254135132">
        </testcase>
        <testcase classname="RealtimeClientTests" name="test__012__RealtimeClient__moves_to_DISCONNECTED_on_an_unexpected_normal_WebSocket_close()" time="1.0078949928283691">
        </testcase>
        <testcase classname="RealtimeClientTests" name="test__013__RealtimeClient__options__should_support_the_same_options_as_the_Rest_client()" time="0.29218292236328125">
        </testcase>
        <testcase classname="RealtimeClientTests" name="test__014__RealtimeClient__options__should_echoMessages_option_be_true_by_default()" time="0.0004899501800537109">
        </testcase>
        <testcase classname="RealtimeClientTests" name="test__015__RealtimeClient__options__should_autoConnect_option_be_true_by_default()" time="0.0004119873046875">
        </testcase>
        <testcase classname="RealtimeClientTests" name="test__016__RealtimeClient__options__should_attempt_to_recover_the_connection_state_if_recover_string_is_assigned()" time="0.5981899499893188">
        </testcase>
        <testcase classname="RealtimeClientTests" name="test__017__RealtimeClient__options__should_connect_to_the_endpoint_if_it_is_a_hostname()" time="0.027050018310546875">
        </testcase>
        <testcase classname="RealtimeClientTests" name="test__018__RealtimeClient__options__should_modify_both_the_REST_and_realtime_host_if_endpoint_is_assigned()" time="0.001600027084350586">
        </testcase>
        <testcase classname="RealtimeClientTests" name="test__019__RealtimeClient__options__url_should_contains_transport_params()" time="0.0029419660568237305">
        </testcase>
        <testcase classname="RealtimeClientTests" name="test__020__RealtimeClient__Auth_object__should_provide_access_to_the_Auth_object()" time="0.001734018325805664">
        </testcase>
        <testcase classname="RealtimeClientTests" name="test__021__RealtimeClient__Auth_object__clientId_may_be_populated_when_the_connection_is_established()" time="0.3294680118560791">
        </testcase>
        <testcase classname="RealtimeClientTests" name="test__022__RealtimeClient__stats__should_present_an_async_interface()" time="0.2893240451812744">
        </testcase>
        <testcase classname="RealtimeClientTests" name="test__023__RealtimeClient__stats__should_accept_all_the_same_params_as_RestClient()" time="0.6792229413986206">
            <failure message="XCTAssertEqual failed: (&quot;28&quot;) is not equal to (&quot;27&quot;) (/Users/runner/work/ably-cocoa/ably-cocoa/Test/AblyTests/Tests/RealtimeClientTests.swift#EndingLineNumber=351&amp;StartingLineNumber=351)">
            </failure>
        </testcase>
        <testcase classname="RealtimeClientTests" name="test__023__RealtimeClient__stats__should_accept_all_the_same_params_as_RestClient()" time="0.6997289657592773">
        </testcase>
        <testcase classname="RealtimeClientTests" name="test__024__RealtimeClient__time__should_present_an_async_interface()" time="0.19086599349975586">
        </testcase>
        <testcase classname="RealtimeClientTests" name="test__025__RealtimeClient__Auth_authorize_should_upgrade_the_connection_with_current_token__in_the_CONNECTED_state_and_auth_authorize_is_called__the_client_must_obtain_a_new_token__send_an_AUTH_ProtocolMessage_with_an_auth_attribute()" time="0.7170159816741943">
        </testcase>
        <testcase classname="RealtimeClientTests" name="test__026__RealtimeClient__Auth_authorize_should_upgrade_the_connection_with_current_token__when_the_authentication_token_change_is_successful__then_the_client_should_receive_a_new_CONNECTED_ProtocolMessage()" time="0.7607920169830322">
        </testcase>
        <testcase classname="RealtimeClientTests" name="test__027__RealtimeClient__Auth_authorize_should_upgrade_the_connection_with_current_token__performs_an_upgrade_of_capabilities_without_any_loss_of_continuity_or_connectivity_during_the_upgrade_process()" time="0.8661619424819946">
        </testcase>
        <testcase classname="RealtimeClientTests" name="test__028__RealtimeClient__Auth_authorize_should_upgrade_the_connection_with_current_token__when_capabilities_are_downgraded__client_should_receive_an_ERROR_ProtocolMessage_with_a_channel_property()" time="0.7898740768432617">
        </testcase>
        <testcase classname="RealtimeClientTests" name="test__029__RealtimeClient__Auth_authorize_should_upgrade_the_connection_with_current_token__when_the_authentication_token_change_fails__client_should_receive_an_ERROR_ProtocolMessage_triggering_the_connection_to_transition_to_the_FAILED_state()" time="0.5639289617538452">
        </testcase>
        <testcase classname="RealtimeClientTests" name="test__030__RealtimeClient__Auth_authorize_should_upgrade_the_connection_with_current_token__authorize_call_should_complete_with_an_error_if_the_request_fails()" time="0.48349010944366455">
        </testcase>
        <testcase classname="RealtimeClientTests" name="test__031__RealtimeClient__Auth_authorize_should_upgrade_the_connection_with_current_token__authorize_call_should_be_indicated_as_completed_with_the_new_token_or_error_only_once_realtime_has_responded_to_the_AUTH_with_either_a_CONNECTED_or_ERROR_respectively()" time="0.6655150651931763">
        </testcase>
        <testcase classname="RealtimeClientTests" name="test__032__RealtimeClient__Auth_authorize_should_upgrade_the_connection_with_current_token__when_connection_is_CONNECTING__all_current_connection_attempts_should_be_halted__and_after_obtaining_a_new_token_the_library_should_immediately_initiate_a_connection_attempt_using_the_new_token()" time="0.7990440130233765">
        </testcase>
        <testcase classname="RealtimeClientTests" name="test__033__RealtimeClient__Auth_authorize_should_upgrade_the_connection_with_current_token__authorize_call_should_complete_with_the_new_token_once_the_connection_has_moved_to_the_CONNECTED_state()" time="0.6513479948043823">
        </testcase>
        <testcase classname="RealtimeClientTests" name="test__034__RealtimeClient__Auth_authorize_should_upgrade_the_connection_with_current_token__authorize_call_should_complete_with_an_error_if_the_connection_moves_to_the_FAILED_state()" time="0.48085498809814453">
        </testcase>
        <testcase classname="RealtimeClientTests" name="test__035__RealtimeClient__Auth_authorize_should_upgrade_the_connection_with_current_token__authorize_call_should_complete_with_an_error_if_the_connection_moves_to_the_SUSPENDED_state()" time="0.48918306827545166">
        </testcase>
        <testcase classname="RealtimeClientTests" name="test__036__RealtimeClient__Auth_authorize_should_upgrade_the_connection_with_current_token__authorize_call_should_complete_with_an_error_if_the_connection_moves_to_the_CLOSED_state()" time="0.5381200313568115">
        </testcase>
        <testcase classname="RealtimeClientTests" name="test__037__RealtimeClient__Auth_authorize_should_upgrade_the_connection_with_current_token__when_the_connection_is_in_the_SUSPENDED_state_when_auth_authorize_is_called__after_obtaining_a_token_the_library_should_move_to_the_CONNECTING_state_and_initiate_a_connection_attempt_using_the_new_token()" time="0.9776040315628052">
        </testcase>
        <testcase classname="RealtimeClientTests" name="test__038__RealtimeClient__Auth_authorize_should_upgrade_the_connection_with_current_token__when_the_connection_is_in_the_CLOSED_state_when_auth_authorize_is_called__after_obtaining_a_token_the_library_should_move_to_the_CONNECTING_state_and_initiate_a_connection_attempt_using_the_new_token()" time="1.0319819450378418">
        </testcase>
        <testcase classname="RealtimeClientTests" name="test__039__RealtimeClient__Auth_authorize_should_upgrade_the_connection_with_current_token__when_the_connection_is_in_the_DISCONNECTED_state_when_auth_authorize_is_called__after_obtaining_a_token_the_library_should_move_to_the_CONNECTING_state_and_initiate_a_connection_attempt_using_the_new_token()" time="1.1823310852050781">
        </testcase>
        <testcase classname="RealtimeClientTests" name="test__040__RealtimeClient__Auth_authorize_should_upgrade_the_connection_with_current_token__when_the_connection_is_in_the_FAILED_state_when_auth_authorize_is_called__after_obtaining_a_token_the_library_should_move_to_the_CONNECTING_state_and_initiate_a_connection_attempt_using_the_new_token()" time="0.9421089887619019">
        </testcase>
        <testcase classname="RealtimeClientTests" name="test__041__If_the_total_size_of_message_s__exceeds_the_maxMessageSize__the_client_library_should_reject_the_publish_and_indicate_an_error()" time="0.3084290027618408">
        </testcase>
        <testcase classname="RealtimeClientTests" name="test__042__If_the_total_size_of_message_s__exceeds_the_maxMessageSize__the_client_library_should_reject_also_presence_messages__enter_()" time="0.29248690605163574">
        </testcase>
        <testcase classname="RealtimeClientTests" name="test__043__If_the_total_size_of_message_s__exceeds_the_maxMessageSize__the_client_library_should_reject_also_presence_messages__leave_()" time="0.27941298484802246">
        </testcase>
        <testcase classname="RealtimeClientTests" name="test__044__If_the_total_size_of_message_s__exceeds_the_maxMessageSize__the_client_library_should_reject_also_presence_messages__update_()" time="0.30789804458618164">
        </testcase>
        <testcase classname="RealtimeClientTests" name="test__045__If_the_total_size_of_message_s__exceeds_the_maxMessageSize__the_client_library_should_reject_also_presence_messages__updateClient_()" time="0.29904496669769287">
        </testcase>
        <testcase classname="RealtimeClientTests" name="test__046__If_the_total_size_of_message_s__exceeds_the_maxMessageSize__the_client_library_should_reject_also_presence_messages__leaveClient_()" time="0.29806292057037354">
        </testcase>
        <testcase classname="RealtimeClientTests" name="test_clientId()" time="0.45446300506591797">
        </testcase>
        <testcase classname="RetrySequenceTests" name="test_addRetryAttempt()" time="0.0006229877471923828">
        </testcase>
        <testcase classname="StatsTests" name="test__001__Stats__all__should_return_a_MessagesTypes_object()" time="0.0031300783157348633">
        </testcase>
        <testcase classname="StatsTests" name="test__002__Stats__all__should_return_value_for_message_counts()" time="0.000720977783203125">
        </testcase>
        <testcase classname="StatsTests" name="test__003__Stats__all__should_return_value_for_all_data_transferred()" time="0.0005649328231811523">
        </testcase>
        <testcase classname="StatsTests" name="test__004__Stats__all__should_return_zero_for_empty_values()" time="0.0004869699478149414">
        </testcase>
        <testcase classname="StatsTests" name="test__005__Stats__persisted__should_return_a_MessagesTypes_object()" time="0.0014770030975341797">
        </testcase>
        <testcase classname="StatsTests" name="test__006__Stats__persisted__should_return_value_for_message_counts()" time="0.0006519556045532227">
        </testcase>
        <testcase classname="StatsTests" name="test__007__Stats__persisted__should_return_value_for_all_data_transferred()" time="0.004484057426452637">
        </testcase>
        <testcase classname="StatsTests" name="test__008__Stats__persisted__should_return_zero_for_empty_values()" time="0.001127004623413086">
        </testcase>
        <testcase classname="StatsTests" name="test__009__Stats__inbound__should_return_a_MessageTraffic_object()" time="0.0041120052337646484">
        </testcase>
        <testcase classname="StatsTests" name="test__010__Stats__inbound__should_return_value_for_realtime_message_counts()" time="0.0010530948638916016">
        </testcase>
        <testcase classname="StatsTests" name="test__011__Stats__inbound__should_return_value_for_all_presence_data()" time="0.0006409883499145508">
        </testcase>
        <testcase classname="StatsTests" name="test__012__Stats__outbound__should_return_a_MessageTraffic_object()" time="0.0015289783477783203">
        </testcase>
        <testcase classname="StatsTests" name="test__013__Stats__outbound__should_return_value_for_realtime_message_counts()" time="0.0005270242691040039">
        </testcase>
        <testcase classname="StatsTests" name="test__014__Stats__outbound__should_return_value_for_all_presence_data()" time="0.00044608116149902344">
        </testcase>
        <testcase classname="StatsTests" name="test__015__Stats__connections__should_return_a_ConnectionTypes_object()" time="0.0034890174865722656">
        </testcase>
        <testcase classname="StatsTests" name="test__016__Stats__connections__should_return_value_for_tls_opened_counts()" time="0.00048089027404785156">
        </testcase>
        <testcase classname="StatsTests" name="test__017__Stats__connections__should_return_value_for_all_peak_connections()" time="0.0004819631576538086">
        </testcase>
        <testcase classname="StatsTests" name="test__018__Stats__connections__should_return_zero_for_empty_values()" time="0.00041997432708740234">
        </testcase>
        <testcase classname="StatsTests" name="test__019__Stats__channels__should_return_a_ResourceCount_object()" time="0.007716059684753418">
        </testcase>
        <testcase classname="StatsTests" name="test__020__Stats__channels__should_return_value_for_opened_counts()" time="0.0004559755325317383">
        </testcase>
        <testcase classname="StatsTests" name="test__021__Stats__channels__should_return_value_for_peak_channels()" time="0.0003839731216430664">
        </testcase>
        <testcase classname="StatsTests" name="test__022__Stats__channels__should_return_zero_for_empty_values()" time="0.0006890296936035156">
        </testcase>
        <testcase classname="StatsTests" name="test__023__Stats__apiRequests__should_return_a_RequestCount_object()" time="0.01088106632232666">
        </testcase>
        <testcase classname="StatsTests" name="test__024__Stats__apiRequests__should_return_value_for_succeeded()" time="0.0016570091247558594">
        </testcase>
        <testcase classname="StatsTests" name="test__025__Stats__apiRequests__should_return_value_for_failed()" time="0.0011370182037353516">
        </testcase>
        <testcase classname="StatsTests" name="test__026__Stats__tokenRequests__should_return_a_RequestCount_object()" time="0.0015980005264282227">
        </testcase>
        <testcase classname="StatsTests" name="test__027__Stats__tokenRequests__should_return_value_for_succeeded()" time="0.001435995101928711">
        </testcase>
        <testcase classname="StatsTests" name="test__028__Stats__tokenRequests__should_return_value_for_failed()" time="0.0007059574127197266">
        </testcase>
        <testcase classname="StatsTests" name="test__029__Stats__interval__should_return_a_Date_object_representing_the_start_of_the_interval()" time="0.010204076766967773">
        </testcase>
        <testcase classname="StatsTests" name="test__030__Stats__push__should_return_a_StatsPushCount_object()" time="0.0030319690704345703">
        </testcase>
        <testcase classname="StatsTests" name="test__031__Stats__push__should_return_value_for_messages_count()" time="0.00048100948333740234">
        </testcase>
        <testcase classname="StatsTests" name="test__032__Stats__push__should_return_value_for_invalid_notifications()" time="0.0004960298538208008">
        </testcase>
        <testcase classname="StatsTests" name="test__033__Stats__push__should_return_value_for_attempted_notifications()" time="0.0005819797515869141">
        </testcase>
        <testcase classname="StatsTests" name="test__034__Stats__push__should_return_value_for_successful_notifications()" time="0.0004190206527709961">
        </testcase>
        <testcase classname="StatsTests" name="test__035__Stats__push__should_return_value_for_failed_notifications()" time="0.00038301944732666016">
        </testcase>
        <testcase classname="StatsTests" name="test__036__Stats__push__should_return_value_for_directPublishes()" time="0.009160041809082031">
        </testcase>
        <testcase classname="StatsTests" name="test__037__Stats__inProgress__should_return_a_Date_object_representing_the_last_sub_interval_included_in_this_statistic()" time="0.0013580322265625">
        </testcase>
        <testcase classname="StatsTests" name="test__038__Stats__count__should_return_value_for_number_of_lower_level_stats()" time="0.0014089345932006836">
        </testcase>
        <testcase classname="StringifiableTests" name="test__001__Stringifiable__type_conversion__as_string()" time="0.0012559890747070312">
        </testcase>
        <testcase classname="StringifiableTests" name="test__002__Stringifiable__type_conversion__as_bool__true_()" time="0.0017310380935668945">
        </testcase>
        <testcase classname="StringifiableTests" name="test__003__Stringifiable__type_conversion__as_bool__false_()" time="0.0006910562515258789">
        </testcase>
        <testcase classname="StringifiableTests" name="test__004__Stringifiable__type_conversion__as_integer_that_is_not_treated_as_bool__false_()" time="0.0004769563674926758">
        </testcase>
        <testcase classname="StringifiableTests" name="test__005__Stringifiable__type_conversion__as_integer_that_is_not_treated_as_bool__true_()" time="0.00262296199798584">
        </testcase>
        <testcase classname="StringifiableTests" name="test__006__Stringifiable__type_conversion__as_number__Int_()" time="0.0011008977890014648">
        </testcase>
        <testcase classname="StringifiableTests" name="test__007__Stringifiable__type_conversion__as_number__Float_1_decimal_digit_()" time="0.0017709732055664062">
        </testcase>
        <testcase classname="StringifiableTests" name="test__008__Stringifiable__type_conversion__as_number__Float_2_decimal_digits_()" time="0.010069966316223145">
        </testcase>
        <testcase classname="StringifiableTests" name="test__009__Stringifiable__type_conversion__as_number__Float_4_decimal_digits_()" time="0.001006007194519043">
        </testcase>
        <testcase classname="SummaryTypesTests" name="test__summaryDistinctV1__parses_dictionary_of_summaries()" time="0.011842012405395508">
        </testcase>
        <testcase classname="SummaryTypesTests" name="test__summaryFlagV1__parses_from_dictionary()" time="0.0008720159530639648">
        </testcase>
        <testcase classname="SummaryTypesTests" name="test__summaryFlagV1__returns_nil_for_invalid_dictionary()" time="0.000491023063659668">
        </testcase>
        <testcase classname="SummaryTypesTests" name="test__summaryFlagV1__with_clipped_property()" time="0.0004769563674926758">
        </testcase>
        <testcase classname="SummaryTypesTests" name="test__summaryMultipleV1__parses_dictionary_of_summaries()" time="0.006338000297546387">
        </testcase>
        <testcase classname="SummaryTypesTests" name="test__summaryMultipleV1__returns_nil_for_invalid_values()" time="0.03392302989959717">
        </testcase>
        <testcase classname="SummaryTypesTests" name="test__summaryTotalV1__parses_from_dictionary()" time="0.0024110078811645508">
        </testcase>
        <testcase classname="SummaryTypesTests" name="test__summaryTotalV1__parses_string_number_from_dictionary()" time="0.0009959936141967773">
        </testcase>
        <testcase classname="SummaryTypesTests" name="test__summaryUniqueV1__parses_dictionary_of_summaries()" time="0.0004830360412597656">
        </testcase>
        <testcase classname="SystemTimeProviderTests" name="test_continuousClock_addingDuration()" time="0.5084220170974731">
        </testcase>
        <testcase classname="SystemTimeProviderTests" name="test_continuousClock_isAfter()" time="0.26048898696899414">
        </testcase>
        <testcase classname="SystemTimeProviderTests" name="test_schedule_derefsBlockAfterInvoke()" time="0.0007491111755371094">
        </testcase>
        <testcase classname="UtilitiesTests" name="test__001__Utilities__JSON_Encoder__should_decode_a_protocol_message_that_has_an_error_without_a_message()" time="0.0005090236663818359">
        </testcase>
        <testcase classname="UtilitiesTests" name="test__002__Utilities__JSON_Encoder__should_encode_a_protocol_message_that_has_invalid_data()" time="0.010602951049804688">
        </testcase>
        <testcase classname="UtilitiesTests" name="test__003__Utilities__JSON_Encoder__should_decode_data_with_malformed_JSON()" time="0.0007270574569702148">
        </testcase>
        <testcase classname="UtilitiesTests" name="test__004__Utilities__JSON_Encoder__should_decode_data_with_malformed_MsgPack()" time="0.0065239667892456055">
        </testcase>
        <testcase classname="UtilitiesTests" name="test__005__Utilities__JSON_Encoder__in_Realtime__should_handle_and_emit_the_invalid_data_error()" time="0.004062056541442871">
        </testcase>
        <testcase classname="UtilitiesTests" name="test__006__Utilities__JSON_Encoder__in_Realtime__should_ignore_invalid_transport_message()" time="0.37509405612945557">
        </testcase>
        <testcase classname="UtilitiesTests" name="test__007__Utilities__JSON_Encoder__in_Rest__should_handle_and_emit_the_invalid_data_error()" time="0.0015149116516113281">
        </testcase>
        <testcase classname="UtilitiesTests" name="test__008__Utilities__JSON_Encoder__in_Rest__should_ignore_invalid_response_payload()" time="0.012005925178527832">
        </testcase>
        <testcase classname="UtilitiesTests" name="test__009__Utilities__EventEmitter__should_emit_events_to_all_relevant_listeners()" time="0.0007569789886474609">
        </testcase>
        <testcase classname="UtilitiesTests" name="test__010__Utilities__EventEmitter__should_only_call_once_listeners_once_for_its_event()" time="0.000538945198059082">
        </testcase>
        <testcase classname="UtilitiesTests" name="test__011__Utilities__EventEmitter__calling_off_with_a_single_listener_argument__should_stop_receiving_events_when_calling_off_with_a_single_listener_argument()" time="0.0006699562072753906">
        </testcase>
        <testcase classname="UtilitiesTests" name="test__012__Utilities__EventEmitter__calling_off_with_a_single_listener_argument__should_remove_the_timeout()" time="0.3182729482650757">
        </testcase>
        <testcase classname="UtilitiesTests" name="test__013__Utilities__EventEmitter__calling_off_with_listener_and_event_arguments__should_still_receive_events_if_off_doesn_t_match_the_listener_s_criteria()" time="0.001510024070739746">
        </testcase>
        <testcase classname="UtilitiesTests" name="test__014__Utilities__EventEmitter__calling_off_with_listener_and_event_arguments__should_stop_receive_events_if_off_matches_the_listener_s_criteria()" time="0.0014129877090454102">
        </testcase>
        <testcase classname="UtilitiesTests" name="test__015__Utilities__EventEmitter__calling_off_with_no_arguments__should_remove_all_listeners()" time="0.0012170076370239258">
        </testcase>
        <testcase classname="UtilitiesTests" name="test__016__Utilities__EventEmitter__calling_off_with_no_arguments__should_allow_listening_again()" time="0.0006209611892700195">
        </testcase>
        <testcase classname="UtilitiesTests" name="test__017__Utilities__EventEmitter__calling_off_with_no_arguments__should_remove_all_timeouts()" time="0.15817594528198242">
        </testcase>
        <testcase classname="UtilitiesTests" name="test__018__Utilities__EventEmitter__the_timed_method__should_not_call_onTimeout_if_the_deadline_isn_t_reached()" time="0.3127169609069824">
        </testcase>
        <testcase classname="UtilitiesTests" name="test__019__Utilities__EventEmitter__the_timed_method__should_call_onTimeout_and_off_the_listener_if_the_deadline_is_reached()" time="0.37272000312805176">
        </testcase>
        <testcase classname="UtilitiesTests" name="test__020__Utilities__EventEmitter__set_of_listeners__should_not_change_over_the_course_of_the_emit()" time="0.0015540122985839844">
        </testcase>
        <testcase classname="UtilitiesTests" name="test__021__Utilities__Logger__should_have_a_history_of_logs()" time="0.3632849454879761">
        </testcase>
        <testcase classname="UtilitiesTests" name="test__022__Utilities__maxMessageSize__calculates_maxMessageSize_of_a_Message_with_name_and_data()" time="0.00048804283142089844">
        </testcase>
        <testcase classname="UtilitiesTests" name="test__023__Utilities__maxMessageSize__calculates_maxMessageSize_of_a_Message_with_name__data_and_extras()" time="0.0005559921264648438">
        </testcase>
        <testcase classname="UtilitiesTests" name="test__024__Utilities__maxMessageSize__calculates_maxMessageSize_of_a_Message_with_name__data__clientId_and_extras()" time="0.0017000436782836914">
        </testcase>
        <testcase classname="UtilitiesTests" name="test__025_Utilities__message_should_populate_serial_timestamp_to_version()" time="0.0005979537963867188">
        </testcase>
        <testcase classname="UtilitiesTests" name="test__026_Utilities__message_should_always_populate_annotations_and_summary_when_decoding()" time="0.0017648935317993164">
        </testcase>
        <testcase classname="UtilitiesTests" name="test__027__Utilities__maxMessageSize__measures_unicode_fields_per_documented_accounting()" time="0.0013179779052734375">
        </testcase>
        <testcase classname="UtilitiesTests" name="test__027_Utilities__message_received_with_new_version_structure()" time="0.0013689994812011719">
        </testcase>
        <testcase classname="UtilitiesTests" name="test__028_Utilities__message_encoding_with_version_and_annotations()" time="0.0005860328674316406">
        </testcase>
        <testcase classname="UtilitiesTests" name="test__029_Utilities__message_summary_that_is_not_an_object_decodes_as_empty()" time="0.0004379749298095703">
        </testcase>
        <testcase classname="UtilitiesTests" name="test__030_Utilities__message_version_metadata_keeps_only_string_values()" time="0.0006709098815917969">
        </testcase>
        <testcase classname="UtilitiesTests" name="test__Utilities__JSON_Encoder__should_decode_rest_error_response_with_complete_error_info()" time="0.0010269880294799805">
        </testcase>
        <testcase classname="UtilitiesTests" name="test__Utilities__JSON_Encoder__should_decode_rest_error_response_with_only_error_field()" time="0.003960013389587402">
        </testcase>
        <testcase classname="WrapperSDKProxyTests" name="test_addsAgentChannelParam_whenFetchedWithChannelOptions()" time="0.3954329490661621">
        </testcase>
        <testcase classname="WrapperSDKProxyTests" name="test_addsAgentChannelParam_whenFetchedWithNoChannelOptions()" time="0.38762998580932617">
        </testcase>
        <testcase classname="WrapperSDKProxyTests" name="test_doesNotAddAgentParam_whenProxyClientCreatedWithoutAgents()" time="0.3820899724960327">
        </testcase>
        <testcase classname="WrapperSDKProxyTests" name="test_history_addsWrapperSDKAgentToRequest()" time="1.2908389568328857">
        </testcase>
        <testcase classname="WrapperSDKProxyTests" name="test_presenceHistory_addsWrapperSDKAgentToRequest()" time="0.2879859209060669">
        </testcase>
        <testcase classname="WrapperSDKProxyTests" name="test_pushAdmin_addsWrapperSDKAgentToRequests()" time="0.19352900981903076">
        </testcase>
        <testcase classname="WrapperSDKProxyTests" name="test_pushAdmin_channelSubscriptions_addsWrapperSDKAgentToRequests()" time="0.27073395252227783">
        </testcase>
        <testcase classname="WrapperSDKProxyTests" name="test_pushAdmin_deviceRegistrations_addsWrapperSDKAgentToRequests()" time="0.20310509204864502">
        </testcase>
        <testcase classname="WrapperSDKProxyTests" name="test_request_addsWrapperSDKAgentToHeader()" time="0.20607399940490723">
        </testcase>
        <testcase classname="WrapperSDKProxyTests" name="test_request_firstAndNext_addWrapperSDKAgentToHeader()" time="1.2680410146713257">
        </testcase>
        <testcase classname="WrapperSDKProxyTests" name="test_sharesChannelMessageSubscriptionsWithUnderlyingChannel()" time="0.405115008354187">
        </testcase>
        <testcase classname="WrapperSDKProxyTests" name="test_sharesChannelStateSubscriptionsWithUnderlyingChannel()" time="0.36041200160980225">
        </testcase>
        <testcase classname="WrapperSDKProxyTests" name="test_sharesChannelStateWithUnderlyingChannel()" time="0.44054603576660156">
        </testcase>
        <testcase classname="WrapperSDKProxyTests" name="test_sharesConnectionStateWithUnderlyingClient()" time="0.372330904006958">
        </testcase>
        <testcase classname="WrapperSDKProxyTests" name="test_sharesConnectionSubscriptionsWithUnderlyingRealtimeClient()" time="0.3079519271850586">
        </testcase>
        <testcase classname="WrapperSDKProxyTests" name="test_stats_addsWrapperSDKAgentToRequest()" time="0.2506059408187866">
        </testcase>
        <testcase classname="WrapperSDKProxyTests" name="test_time_addsWrapperSDKAgentToRequest()" time="0.2032010555267334">
        </testcase>
    </testsuite>
    <testsuite name="AblyTestsObjC" tests="13" failures="0" skipped="0" time="0.035470008850097656">
        <properties>
          <property name="Configuration" value="Test Scheme Action"/>
        </properties>
        <testcase classname="ARTInternalLogTests" name="test_ARTLogDebug" time="0.001459956169128418">
        </testcase>
        <testcase classname="ARTInternalLogTests" name="test_ARTLogError" time="0.000431060791015625">
        </testcase>
        <testcase classname="ARTInternalLogTests" name="test_ARTLogInfo" time="0.00040400028228759766">
        </testcase>
        <testcase classname="ARTInternalLogTests" name="test_ARTLogVerbose" time="0.00040900707244873047">
        </testcase>
        <testcase classname="ARTInternalLogTests" name="test_ARTLogWarn" time="0.0006899833679199219">
        </testcase>
        <testcase classname="ARTInternalLogTests" name="test_classMethodLogger" time="0.0004919767379760742">
        </testcase>
        <testcase classname="ARTMessageVersionAndAnnotationsTests" name="test_annotations_do_not_change_when_a_nested_summary_value_is_mutated" time="0.0006680488586425781">
        </testcase>
        <testcase classname="ARTMessageVersionAndAnnotationsTests" name="test_copy_returns_the_same_instance" time="0.0089949369430542">
        </testcase>
        <testcase classname="ARTMessageVersionAndAnnotationsTests" name="test_version_does_not_change_when_its_arguments_are_mutated" time="0.0004659891128540039">
        </testcase>
        <testcase classname="ARTPubSubDeviceTests" name="test_createClient_returns_a_realtime_client_declaring_the_device_agent" time="0.01726400852203369">
        </testcase>
        <testcase classname="ARTPubSubDeviceTests" name="test_createClientWithKey_declares_the_device_agent" time="0.0026390552520751953">
        </testcase>
        <testcase classname="CryptoTest" name="testEncryptAndDecrypt" time="0.0009349584579467773">
        </testcase>
        <testcase classname="ObjcppTest" name="testPrintVersionInfo" time="0.0006170272827148438">
        </testcase>
    </testsuite>
</testsuites>