<testsuites tests="1121" failures="0">
    <testsuite name="AblyTests" tests="1106" failures="0" skipped="0" time="1774.9388746023178">
        <properties>
          <property name="Configuration" value="Test Scheme Action"/>
        </properties>
        <testcase classname="ARTDefaultTests" name="testVersions()" time="0.0027390718460083008">
        </testcase>
        <testcase classname="AttachRetryStateTests" name="test_addRetryAttempt()" time="0.0020360946655273438">
        </testcase>
        <testcase classname="AttachRetryStateTests" name="test_transitionToAttachingOrSuspendedStateDoesNotResetRetrySequence()" time="0.011308073997497559">
        </testcase>
        <testcase classname="AttachRetryStateTests" name="test_transitionToNonAttachingOrSuspendedStateResetsRetrySequence()" time="0.0004609823226928711">
        </testcase>
        <testcase classname="AuthTests" name="test__001__should_not_force_token_auth_when_clientId_is_set()" time="2.08302104473114">
        </testcase>
        <testcase classname="AuthTests" name="test__002__should_accept_authURL_response_with_timestamp_argument_as_string()" time="0.295428991317749">
        </testcase>
        <testcase classname="AuthTests" name="test__003__Basic__should_work_over_HTTPS_only()" time="0.00811004638671875">
        </testcase>
        <testcase classname="AuthTests" name="test__004__Basic__should_send_the_API_key_in_the_Authorization_header()" time="0.27546095848083496">
        </testcase>
        <testcase classname="AuthTests" name="test__005__Basic__should_be_default_when_an_API_key_is_set()" time="0.0009759664535522461">
        </testcase>
        <testcase classname="AuthTests" name="test__006__Token__TTL_should_default_to_be_omitted()" time="0.0007369518280029297">
        </testcase>
        <testcase classname="AuthTests" name="test__007__Token__should_URL_query_be_correctly_encoded()" time="0.004960060119628906">
        </testcase>
        <testcase classname="AuthTests" name="test__008__Token__should_omit_capability_field_if_it_is_not_specified()" time="0.178460955619812">
        </testcase>
        <testcase classname="AuthTests" name="test__009__Token__should_add_capability_field_if_the_user_specifies_it()" time="0.18759000301361084">
        </testcase>
        <testcase classname="AuthTests" name="test__010__Token__token_auth__should_work_over_HTTP()" time="0.36387503147125244">
        </testcase>
        <testcase classname="AuthTests" name="test__011__Token__token_auth__should_work_over_HTTPS()" time="0.3253690004348755">
        </testcase>
        <testcase classname="AuthTests" name="test__012__Token__token_auth__for_REST_requests__should_send_the_token_in_the_Authorization_header()" time="0.3764619827270508">
        </testcase>
        <testcase classname="AuthTests" name="test__013__Token__token_auth__for_Realtime_connections__should_send_the_token_in_the_querystring_as_a_param_named_accessToken()" time="0.24509799480438232">
        </testcase>
        <testcase classname="AuthTests" name="test__014__Token__authentication_method__should_be_default_auth_method_when_options__useTokenAuth_is_set()" time="0.0008680820465087891">
        </testcase>
        <testcase classname="AuthTests" name="test__015__Token__authentication_method__should_be_default_auth_method_when_options__authUrl_is_set()" time="0.0010770559310913086">
        </testcase>
        <testcase classname="AuthTests" name="test__016__Token__authentication_method__should_be_default_auth_method_when_options__authCallback_is_set()" time="0.05369699001312256">
        </testcase>
        <testcase classname="AuthTests" name="test__017__Token__authentication_method__should_be_default_auth_method_when_options__tokenDetails_is_set()" time="0.000744938850402832">
        </testcase>
        <testcase classname="AuthTests" name="test__018__Token__authentication_method__should_be_default_auth_method_when_options__token_is_set()" time="0.0006129741668701172">
        </testcase>
        <testcase classname="AuthTests" name="test__019__Token__authentication_method__should_be_default_auth_method_when_options__key_is_set()" time="0.07771098613739014">
        </testcase>
        <testcase classname="AuthTests" name="test__020__Token__authentication_method__should_indicate_an_error_and_not_retry_the_request_when_the_server_responds_with_a_token_error_and_there_is_no_way_to_renew_the_token()" time="0.19082796573638916">
        </testcase>
        <testcase classname="AuthTests" name="test__021__Token__authentication_method__should_transition_the_connection_to_the_FAILED_state_when_the_server_responds_with_a_token_error_and_there_is_no_way_to_renew_the_token()" time="3.3771400451660156">
        </testcase>
        <testcase classname="AuthTests" name="test__022__Token__authentication_method__on_token_error__reissues_token_and_retries_REST_requests()" time="1.826238989830017">
        </testcase>
        <testcase classname="AuthTests" name="test__023__Token__authentication_method__in_REST__if_the_token_creation_failed_or_the_subsequent_request_with_the_new_token_failed_due_to_a_token_error__then_the_request_should_result_in_an_error()" time="0.01767599582672119">
        </testcase>
        <testcase classname="AuthTests" name="test__024__Token__authentication_method__in_Realtime__if_the_token_creation_failed_then_the_connection_should_move_to_the_DISCONNECTED_state_and_reports_the_error()" time="0.25835907459259033">
        </testcase>
        <testcase classname="AuthTests" name="test__025__Token__authentication_method__in_Realtime__if_the_connection_fails_due_to_a_terminal_token_error__then_the_connection_should_move_to_the_FAILED_state_and_reports_the_error()" time="2.178030014038086">
        </testcase>
        <testcase classname="AuthTests" name="test__026__Token__authentication_method__if_a_request_by_a_realtime_client_to_an_authUrl_results_in_an_HTTP_403_the_client_library_should_transition_to_the_FAILED_state()" time="0.387768030166626">
        </testcase>
        <testcase classname="AuthTests" name="test__027__Token__authentication_method__if_an_authCallback_results_in_an_HTTP_403_the_client_library_should_transition_to_the_FAILED_state()" time="0.5679008960723877">
        </testcase>
        <testcase classname="AuthTests" name="test__028__Token__authentication_method__local_token_validity_check__should_be_done_if_queryTime_is_true_and_local_time_is_in_sync_with_server()" time="6.788622975349426">
        </testcase>
        <testcase classname="AuthTests" name="test__029__Token__authentication_method__local_token_validity_check__should_NOT_be_done_if_queryTime_is_false_and_local_time_is_NOT_in_sync_with_server()" time="8.400001049041748">
        </testcase>
        <testcase classname="AuthTests" name="test__030__Token__options__should_stop_client_when_useTokenAuth_and_no_key_occurs()" time="0.014754056930541992">
        </testcase>
        <testcase classname="AuthTests" name="test__031__Token__options__should_stop_client_when_authCallback_and_authUrl_occurs()" time="0.14263701438903809">
        </testcase>
        <testcase classname="AuthTests" name="test__032__Token__options__if_an_attempt_by_the_realtime_client_library_to_authenticate_is_made_using_the_authUrl_or_authCallback__the_request_to_authUrl_fails__if_the_connection_is_CONNECTING__then_the_connection_attempt_should_be_treated_as_unsuccessful()" time="0.38631200790405273">
        </testcase>
        <testcase classname="AuthTests" name="test__033__Token__options__if_an_attempt_by_the_realtime_client_library_to_authenticate_is_made_using_the_authUrl_or_authCallback__the_request_to_authUrl_fails__if_the_connection_is_CONNECTED__then_the_connection_should_remain_CONNECTED()" time="1.9906349182128906">
        </testcase>
        <testcase classname="AuthTests" name="test__034__Token__options__if_an_attempt_by_the_realtime_client_library_to_authenticate_is_made_using_the_authUrl_or_authCallback__the_request_to_authCallback_fails__if_the_connection_is_CONNECTING__then_the_connection_attempt_should_be_treated_as_unsuccessful()" time="0.07666099071502686">
        </testcase>
        <testcase classname="AuthTests" name="test__035__Token__options__if_an_attempt_by_the_realtime_client_library_to_authenticate_is_made_using_the_authUrl_or_authCallback__the_request_to_authCallback_fails__if_the_connection_is_CONNECTED__then_the_connection_should_remain_CONNECTED()" time="0.44629907608032227">
        </testcase>
        <testcase classname="AuthTests" name="test__036__Token__options__if_an_attempt_by_the_realtime_client_library_to_authenticate_is_made_using_the_authUrl_or_authCallback__the_provided_token_is_in_an_invalid_format__if_the_connection_is_CONNECTING__then_the_connection_attempt_should_be_treated_as_unsuccessful()" time="0.6990690231323242">
        </testcase>
        <testcase classname="AuthTests" name="test__037__Token__options__if_an_attempt_by_the_realtime_client_library_to_authenticate_is_made_using_the_authUrl_or_authCallback__the_provided_token_is_in_an_invalid_format__if_the_connection_is_CONNECTED__then_the_connection_should_remain_CONNECTED()" time="1.5440369844436646">
        </testcase>
        <testcase classname="AuthTests" name="test__038__Token__options__if_an_attempt_by_the_realtime_client_library_to_authenticate_is_made_using_the_authUrl_or_authCallback__the_attempt_times_out_after_realtimeRequestTimeout__if_the_connection_is_CONNECTING__then_the_connection_attempt_should_be_treated_as_unsuccessful()" time="0.5380719900131226">
        </testcase>
        <testcase classname="AuthTests" name="test__039__Token__options__if_an_attempt_by_the_realtime_client_library_to_authenticate_is_made_using_the_authUrl_or_authCallback__the_attempt_times_out_after_realtimeRequestTimeout__if_the_connection_is_CONNECTED__then_the_connection_should_remain_CONNECTED()" time="2.6198810338974">
        </testcase>
        <testcase classname="AuthTests" name="test__040__Token__token_auth_and_clientId__should_permit_to_be_unauthenticated()" time="0.34233903884887695">
        </testcase>
        <testcase classname="AuthTests" name="test__041__Token__token_auth_and_clientId__should_check_clientId_consistency__on_rest()" time="0.1557539701461792">
        </testcase>
        <testcase classname="AuthTests" name="test__042__Token__token_auth_and_clientId__should_check_clientId_consistency__on_realtime()" time="0.4010930061340332">
        </testcase>
        <testcase classname="AuthTests" name="test__043__Token__token_auth_and_clientId__should_check_clientId_consistency__with_wildcard()" time="0.0029249191284179688">
        </testcase>
        <testcase classname="AuthTests" name="test__044__Token__token_auth_and_clientId__Incompatible_client__with_Realtime__it_should_change_the_connection_state_to_FAILED_and_emit_an_error()" time="0.48834896087646484">
        </testcase>
        <testcase classname="AuthTests" name="test__045__Token__token_auth_and_clientId__Incompatible_client__with_Rest__it_should_result_in_an_appropriate_error_response()" time="0.26292097568511963">
        </testcase>
        <testcase classname="AuthTests" name="test__046__Token__clientId_and_authenticated_clients__should_not_pass_clientId_with_published_message()" time="0.26194095611572266">
        </testcase>
        <testcase classname="AuthTests" name="test__047__Token__clientId_and_authenticated_clients__should_obtain_a_token_if_clientId_is_assigned()" time="0.32110893726348877">
        </testcase>
        <testcase classname="AuthTests" name="test__048__Token__clientId_and_authenticated_clients__should_convenience_clientId_return_a_string()" time="0.027233004570007324">
        </testcase>
        <testcase classname="AuthTests" name="test__049__Token__clientId_and_authenticated_clients__ClientOptions_clientId_takes_precendence_when_a_clientId_value_is_provided_in_both_ClientOptions_clientId_and_ClientOptions_defaultTokenParams()" time="0.7160210609436035">
        </testcase>
        <testcase classname="AuthTests" name="test__050__Token__clientId_and_authenticated_clients__should_clientId_be_null_or_string()" time="0.11330294609069824">
        </testcase>
        <testcase classname="AuthTests" name="test__051__Token__clientId_and_authenticated_clients__Auth_clientId_attribute_is_null__identity_should_be_anonymous_for_all_operations()" time="0.34280598163604736">
        </testcase>
        <testcase classname="AuthTests" name="test__052__Token__clientId_and_authenticated_clients__Auth_clientId_attribute_is_null__identity_may_change_and_become_identified()" time="0.565977931022644">
        </testcase>
        <testcase classname="AuthTests" name="test__053__Token__clientId_and_authenticated_clients__auth_clientId_not_null__when_clientId_attribute_is_assigned_on_client_options()" time="0.0013910531997680664">
        </testcase>
        <testcase classname="AuthTests" name="test__054__Token__clientId_and_authenticated_clients__auth_clientId_not_null__when_tokenRequest_or_tokenDetails_has_clientId_not_null_or_wildcard_string()" time="0.17863905429840088">
        </testcase>
        <testcase classname="AuthTests" name="test__055__Token__clientId_and_authenticated_clients__auth_clientId_not_null__should_CONNECTED_ProtocolMessages_contain_a_clientId()" time="0.4447300434112549">
        </testcase>
        <testcase classname="AuthTests" name="test__056__Token__clientId_and_authenticated_clients__auth_clientId_not_null__client_does_not_have_an_identity_when_a_wildcard_string_____is_present()" time="0.5044509172439575">
        </testcase>
        <testcase classname="AuthTests" name="test__057__requestToken__implicitly_creates_a_TokenRequest_and_requests_a_token()" time="0.5293649435043335">
        </testcase>
        <testcase classname="AuthTests" name="test__058__requestToken__ensure_the_message_published_does_not_have_a_clientId()" time="0.6009069681167603">
        </testcase>
        <testcase classname="AuthTests" name="test__059__requestToken__ensure_that_the_message_is_rejected()" time="0.5584830045700073">
        </testcase>
        <testcase classname="AuthTests" name="test__060__requestToken__ensure_the_message_published_with_a_wildcard_____does_not_have_a_clientId()" time="0.6407550573348999">
        </testcase>
        <testcase classname="AuthTests" name="test__061__requestToken__ensure_the_message_published_with_a_wildcard_____has_the_provided_clientId()" time="0.9632489681243896">
        </testcase>
        <testcase classname="AuthTests" name="test__062__requestToken__arguments__should_not_merge_with_the_configured_params_and_options_but_instead_replace_all_corresponding_values__even_when__null_()" time="0.8917720317840576">
        </testcase>
        <testcase classname="AuthTests" name="test__063__requestToken__arguments__should_use_configured_defaults_if_the_object_arguments_are_omitted()" time="0.8670969009399414">
        </testcase>
        <testcase classname="AuthTests" name="test__064__requestToken__authUrl__query_will_provide_a_token_string()" time="0.47834599018096924">
        </testcase>
        <testcase classname="AuthTests" name="test__065__requestToken__authUrl__query_will_provide_a_TokenDetails()" time="1.2179960012435913">
        </testcase>
        <testcase classname="AuthTests" name="test__066__requestToken__authUrl__query_will_provide_a_TokenRequest()" time="0.8884090185165405">
        </testcase>
        <testcase classname="AuthTests" name="test__067__requestToken__authUrl__TokenParams_should_take_precedence_over_any_configured_authParams_when_a_name_conflict_occurs()" time="2.4791170358657837">
        </testcase>
        <testcase classname="AuthTests" name="test__068__requestToken__authUrl__should_override_previously_configured_parameters()" time="0.003944993019104004">
        </testcase>
        <testcase classname="AuthTests" name="test__069__requestToken__authUrl__parameters__should_be_added_to_the_URL_when_auth_method_is_GET()" time="0.00548398494720459">
        </testcase>
        <testcase classname="AuthTests" name="test__070__requestToken__authUrl__parameters__should_added_on_the_body_request_when_auth_method_is_POST()" time="1.6477429866790771">
        </testcase>
        <testcase classname="AuthTests" name="test__071__requestToken__should_support_all_TokenParams__using_defaults()" time="0.573870062828064">
        </testcase>
        <testcase classname="AuthTests" name="test__072__requestToken__should_support_all_TokenParams__overriding_defaults()" time="0.5188668966293335">
        </testcase>
        <testcase classname="AuthTests" name="test__073__requestToken__When_authCallback_option_is_set__it_will_invoke_the_callback__with_a_token_string()" time="0.005647063255310059">
        </testcase>
        <testcase classname="AuthTests" name="test__074__requestToken__When_authCallback_option_is_set__it_will_invoke_the_callback__with_a_TokenDetails()" time="0.021283984184265137">
        </testcase>
        <testcase classname="AuthTests" name="test__075__requestToken__When_authCallback_option_is_set__it_will_invoke_the_callback__with_a_TokenRequest()" time="2.8322139978408813">
        </testcase>
        <testcase classname="AuthTests" name="test__076__createTokenRequest__should_not_merge_with_the_configured_params_and_options_but_instead_replace_all_corresponding_values__even_when__null_()" time="5.472449064254761">
        </testcase>
        <testcase classname="AuthTests" name="test__077__createTokenRequest__should_override_defaults_if_AuthOptions_provided()" time="0.5274800062179565">
        </testcase>
        <testcase classname="AuthTests" name="test__078__createTokenRequest__should_use_defaults_if_no_AuthOptions_is_provided()" time="0.20214903354644775">
        </testcase>
        <testcase classname="AuthTests" name="test__079__createTokenRequest__should_replace_defaults_if__nil__option_s_field_passed()" time="0.03726792335510254">
        </testcase>
        <testcase classname="AuthTests" name="test__080__createTokenRequest__should_use_configured_defaults_if_the_object_arguments_are_omitted()" time="0.1742570400238037">
        </testcase>
        <testcase classname="AuthTests" name="test__081__createTokenRequest__should_create_and_sign_a_TokenRequest()" time="3.3530770540237427">
        </testcase>
        <testcase classname="AuthTests" name="test__082__createTokenRequest__should_support_AuthOptions()" time="0.0013689994812011719">
        </testcase>
        <testcase classname="AuthTests" name="test__083__createTokenRequest__should_generate_a_unique_16_plus_character_nonce_if_none_is_provided()" time="3.890048027038574">
        </testcase>
        <testcase classname="AuthTests" name="test__084__createTokenRequest__should_provide_capability_has_json_text()" time="0.0033750534057617188">
        </testcase>
        <testcase classname="AuthTests" name="test__085__createTokenRequest__should_generate_a_valid_HMAC()" time="0.0021589994430541992">
        </testcase>
        <testcase classname="AuthTests" name="test__086__createTokenRequest__should_respect_all_requirements()" time="0.27910494804382324">
        </testcase>
        <testcase classname="AuthTests" name="test__087__createTokenRequest__should_generate_a_timestamp__from_current_time_if_not_provided()" time="0.3423870801925659">
        </testcase>
        <testcase classname="AuthTests" name="test__088__createTokenRequest__should_generate_a_timestamp__will_retrieve_the_server_time_if_queryTime_is_true()" time="0.2027420997619629">
        </testcase>
        <testcase classname="AuthTests" name="test__089__createTokenRequest__TTL__should_be_optional()" time="0.012709975242614746">
        </testcase>
        <testcase classname="AuthTests" name="test__090__createTokenRequest__TTL__should_be_specified_in_milliseconds()" time="0.5964070558547974">
        </testcase>
        <testcase classname="AuthTests" name="test__091__createTokenRequest__TTL__should_be_valid_to_request_a_token_for_24_hours()" time="0.1777399778366089">
        </testcase>
        <testcase classname="AuthTests" name="test__092__authorize__should_always_create_a_token()" time="0.6552489995956421">
        </testcase>
        <testcase classname="AuthTests" name="test__093__authorize__should_create_a_new_token_if_one_already_exist_and_ensure_Token_Auth_is_used_for_all_future_requests()" time="0.6670430898666382">
        </testcase>
        <testcase classname="AuthTests" name="test__094__authorize__should_create_a_token_immediately_and_ensures_Token_Auth_is_used_for_all_future_requests()" time="0.4595620632171631">
        </testcase>
        <testcase classname="AuthTests" name="test__095__authorize__should_supports_all_TokenParams_and_AuthOptions()" time="0.20222997665405273">
        </testcase>
        <testcase classname="AuthTests" name="test__096__authorize__should_use_the_requestToken_implementation()" time="0.1613680124282837">
        </testcase>
        <testcase classname="AuthTests" name="test__097__authorize__should_return_TokenDetails_with_valid_token_metadata()" time="0.19080603122711182">
        </testcase>
        <testcase classname="AuthTests" name="test__098__authorize__should_use_the_configured_Auth_clientId__if_not_null__by_default()" time="0.4128079414367676">
        </testcase>
        <testcase classname="AuthTests" name="test__099__authorize__on_subsequent_authorisations__should_store_the_AuthOptions_with_authUrl()" time="0.5345950126647949">
        </testcase>
        <testcase classname="AuthTests" name="test__100__authorize__on_subsequent_authorisations__should_store_the_AuthOptions_with_authCallback()" time="0.002928018569946289">
        </testcase>
        <testcase classname="AuthTests" name="test__101__authorize__on_subsequent_authorisations__should_not_store_queryTime()" time="0.3404390811920166">
        </testcase>
        <testcase classname="AuthTests" name="test__102__authorize__on_subsequent_authorisations__should_store_the_TokenParams()" time="2.420078992843628">
        </testcase>
        <testcase classname="AuthTests" name="test__103__authorize__on_subsequent_authorisations__should_use_configured_defaults_if_the_object_arguments_are_omitted()" time="0.41145503520965576">
        </testcase>
        <testcase classname="AuthTests" name="test__104__authorize__should_adhere_to_all_requirements_relating_to__TokenParams()" time="0.16325592994689941">
        </testcase>
        <testcase classname="AuthTests" name="test__105__authorize__should_adhere_to_all_requirements_relating_to__authCallback()" time="0.16184699535369873">
        </testcase>
        <testcase classname="AuthTests" name="test__106__authorize__should_adhere_to_all_requirements_relating_to__authUrl()" time="0.1484220027923584">
        </testcase>
        <testcase classname="AuthTests" name="test__107__authorize__should_adhere_to_all_requirements_relating_to__authUrl_with_json()" time="0.6085439920425415">
        </testcase>
        <testcase classname="AuthTests" name="test__108__authorize__should_adhere_to_all_requirements_relating_to__authUrl_returning_TokenRequest_decodes_TTL_as_expected()" time="0.3401830196380615">
        </testcase>
        <testcase classname="AuthTests" name="test__109__authorize__should_adhere_to_all_requirements_relating_to__authUrl_with_plain_text()" time="0.4864879846572876">
        </testcase>
        <testcase classname="AuthTests" name="test__110__authorize__when_TokenParams_and_AuthOptions_are_provided__should_supersede_configured_AuthOptions__using_key__even_if_arguments_objects_are_empty()" time="1.3519150018692017">
        </testcase>
        <testcase classname="AuthTests" name="test__111__authorize__when_TokenParams_and_AuthOptions_are_provided__should_supersede_configured_AuthOptions__using_authUrl__even_if_arguments_objects_are_empty()" time="0.766414999961853">
        </testcase>
        <testcase classname="AuthTests" name="test__112__authorize__when_TokenParams_and_AuthOptions_are_provided__should_supersede_configured_AuthOptions__using_authCallback__even_if_arguments_objects_are_empty()" time="0.005180001258850098">
        </testcase>
        <testcase classname="AuthTests" name="test__113__authorize__when_TokenParams_and_AuthOptions_are_provided__should_supersede_configured_params_and_options_even_if_arguments_objects_are_empty()" time="0.7154860496520996">
        </testcase>
        <testcase classname="AuthTests" name="test__114__authorize__when_TokenParams_and_AuthOptions_are_provided__example__if_a_client_is_initialised_with_TokenParams_ttl_configured_with_a_custom_value__and_a_TokenParams_object_is_passed_in_as_an_argument_to__authorize_with_a_null_value_for_ttl__then_the_ttl_used_for_every_subsequent_authorization_will_be_null()" time="1.1984219551086426">
        </testcase>
        <testcase classname="AuthTests" name="test__115__authorize__server_time_offset__should_obtain_server_time_once_and_persist_the_offset_from_the_local_clock()" time="0.45121896266937256">
        </testcase>
        <testcase classname="AuthTests" name="test__116__authorize__server_time_offset__should_be_consistent_the_timestamp_request_with_the_server_time()" time="0.16963493824005127">
        </testcase>
        <testcase classname="AuthTests" name="test__117__authorize__server_time_offset__should_be_possible_by_lib_Client_to_discard_the_cached_local_clock_offset()" time="0.5743299722671509">
        </testcase>
        <testcase classname="AuthTests" name="test__118__authorize__server_time_offset__should_use_the_local_clock_offset_to_calculate_the_server_time()" time="0.0023189783096313477">
        </testcase>
        <testcase classname="AuthTests" name="test__119__authorize__server_time_offset__should_request_server_time_when_queryTime_is_true_even_if_the_time_offset_is_assigned()" time="0.8368450403213501">
        </testcase>
        <testcase classname="AuthTests" name="test__120__authorize__server_time_offset__should_discard_the_time_offset_in_situations_in_which_it_may_have_been_invalidated()" time="0.0023200511932373047">
        </testcase>
        <testcase classname="AuthTests" name="test__121__authorize__two_consecutive_authorizations__using_REST__should_call_each_authorize_callback()" time="0.7365609407424927">
        </testcase>
        <testcase classname="AuthTests" name="test__122__authorize__two_consecutive_authorizations__using_Realtime_and_connection_is_CONNECTING__should_call_each_Realtime_authorize_callback()" time="0.8305889368057251">
        </testcase>
        <testcase classname="AuthTests" name="test__123__authorize__two_consecutive_authorizations__using_Realtime_and_connection_is_CONNECTED__should_call_each_Realtime_authorize_callback()" time="0.5804779529571533">
        </testcase>
        <testcase classname="AuthTests" name="test__124__TokenParams__timestamp__if_explicitly_set__should_be_returned_by_the_getter()" time="0.0004949569702148438">
        </testcase>
        <testcase classname="AuthTests" name="test__125__TokenParams__timestamp__if_explicitly_set__the_value_should_stick()" time="0.25884997844696045">
        </testcase>
        <testcase classname="AuthTests" name="test__126__TokenParams__timestamp__object_has_no_timestamp_value_unless_explicitly_set()" time="0.3451049327850342">
        </testcase>
        <testcase classname="AuthTests" name="test__127__Reauth__should_use_authorize__force__true___to_reauth_with_a_token_with_a_different_set_of_capabilities()" time="0.9157639741897583">
        </testcase>
        <testcase classname="AuthTests" name="test__128__Reauth__for_a_token_change_that_fails_due_to_an_incompatible_token__which_should_result_in_the_connection_entering_the_FAILED_state()" time="0.4842749834060669">
        </testcase>
        <testcase classname="AuthTests" name="test__129__TokenParams__timestamp_should_not_be_a_member_of_any_default_token_params()" time="0.16186392307281494">
        </testcase>
        <testcase classname="AuthTests" name="test__130__TokenRequest__fromJson__rejects_invalid_JSON()" time="0.012022018432617188">
        </testcase>
        <testcase classname="AuthTests" name="test__131__TokenRequest__fromJson__rejects_non_object_JSON()" time="0.0015330314636230469">
        </testcase>
        <testcase classname="AuthTests" name="test__132__TokenRequest__fromJson__with_TTL__accepts_a_string__which_should_be_interpreted_as_JSON()" time="0.023718953132629395">
        </testcase>
        <testcase classname="AuthTests" name="test__133__TokenRequest__fromJson__with_TTL__accepts_a_NSDictionary()" time="0.0005559921264648438">
        </testcase>
        <testcase classname="AuthTests" name="test__134__TokenRequest__fromJson__without_TTL__accepts_a_string__which_should_be_interpreted_as_JSON()" time="0.0005600452423095703">
        </testcase>
        <testcase classname="AuthTests" name="test__135__TokenRequest__fromJson__without_TTL__accepts_a_NSDictionary()" time="0.000538945198059082">
        </testcase>
        <testcase classname="AuthTests" name="test__136__TokenDetails__fromJson__accepts_a_string__which_should_be_interpreted_as_JSON()" time="0.0006669759750366211">
        </testcase>
        <testcase classname="AuthTests" name="test__137__TokenDetails__fromJson__accepts_a_NSDictionary()" time="0.0004260540008544922">
        </testcase>
        <testcase classname="AuthTests" name="test__138__TokenDetails__fromJson__rejects_invalid_JSON()" time="0.0004729032516479492">
        </testcase>
        <testcase classname="AuthTests" name="test__139__TokenDetails__fromJson__rejects_non_object_JSON()" time="0.013931989669799805">
        </testcase>
        <testcase classname="AuthTests" name="test__140__JWT_and_realtime__client_initialized_with_a_JWT_token_in_ClientOptions__with_valid_credentials__pulls_stats_successfully()" time="0.17436707019805908">
        </testcase>
        <testcase classname="AuthTests" name="test__141__JWT_and_realtime__client_initialized_with_a_JWT_token_in_ClientOptions__with_invalid_credentials__fails_to_connect_with_reason__invalid_signature_()" time="0.24290001392364502">
        </testcase>
        <testcase classname="AuthTests" name="test__142__JWT_and_realtime__when_using_authUrl__with_valid_credentials__fetches_a_channels_and_posts_a_message()" time="0.5487279891967773">
        </testcase>
        <testcase classname="AuthTests" name="test__143__JWT_and_realtime__when_using_authUrl__with_wrong_credentials__fails_to_connect_with_reason__invalid_signature_()" time="0.7888200283050537">
        </testcase>
        <testcase classname="AuthTests" name="test__144__JWT_and_realtime__when_using_authUrl__when_token_expires__receives_a_40142_error_from_the_server()" time="4.7811119556427">
        </testcase>
        <testcase classname="AuthTests" name="test__145__JWT_and_realtime__when_using_authUrl__when_the_server_sends_and_AUTH_protocol_message__client_reauths_correctly_without_going_through_a_disconnection()" time="5.128345012664795">
        </testcase>
        <testcase classname="AuthTests" name="test__146__JWT_and_realtime__when_using_authCallback__with_valid_credentials__pulls_stats_successfully()" time="0.1782219409942627">
        </testcase>
        <testcase classname="AuthTests" name="test__147__JWT_and_realtime__when_using_authCallback__with_invalid_credentials__fails_to_connect()" time="0.4907950162887573">
        </testcase>
        <testcase classname="AuthTests" name="test__148__JWT_and_realtime__when_token_expires_and_has_a_means_to_renew__reconnects_using_authCallback_and_obtains_a_new_token()" time="2.4432519674301147">
        </testcase>
        <testcase classname="AuthTests" name="test__149__JWT_and_realtime__when_the_token_request_includes_a_clientId__the_clientId_is_the_same_specified_in_the_JWT_token_request()" time="0.25002801418304443">
        </testcase>
        <testcase classname="AuthTests" name="test__150__JWT_and_realtime__when_the_token_request_includes_subscribe_only_capabilities__fails_to_publish_to_a_channel_with_subscribe_only_capability()" time="0.31400108337402344">
        </testcase>
        <testcase classname="AuthTests" name="test__151__currentTokenDetails__should_hold_a__TokenDetails__instance_in_which_only_the__token__attribute_is_populated_with_that_token_string()" time="0.1727050542831421">
        </testcase>
        <testcase classname="AuthTests" name="test__152__currentTokenDetails__should_be_set_with_the_current_token__if_applicable__on_instantiation_and_each_time_it_is_replaced()" time="0.15483200550079346">
        </testcase>
        <testcase classname="AuthTests" name="test__153__currentTokenDetails__should_be_empty_if_there_is_no_current_token()" time="0.0014840364456176758">
        </testcase>
        <testcase classname="AuthTests" name="test__154__JWT_and_rest__when_the_JWT_token_embeds_an_Ably_token__pulls_stats_successfully()" time="0.48968589305877686">
        </testcase>
        <testcase classname="AuthTests" name="test__155__JWT_and_rest__when_the_JWT_token_embeds_an_Ably_token_and_it_is_requested_as_encrypted__pulls_stats_successfully()" time="0.49136507511138916">
        </testcase>
        <testcase classname="AuthTests" name="test__156__JWT_and_rest__when_the_JWT_token_is_returned_with_application_jwt_content_type__the_client_successfully_connects_and_pulls_stats()" time="0.38652002811431885">
        </testcase>
        <testcase classname="AuthTests" name="test__157__JWT_and_rest__when_the_JWT_token_is_returned_with_application_jwt_content_type__the_client_can_request_a_new_token_to_initilize_another_client_that_connects_and_pulls_stats()" time="0.4007570743560791">
        </testcase>
        <testcase classname="BackoffRetryDelayCalculatorTests" name="test_delay()" time="0.015012025833129883">
        </testcase>
        <testcase classname="ChannelOptionsTests" name="test_copyChannelOptions()" time="0.002465963363647461">
        </testcase>
        <testcase classname="ChannelOptionsTests" name="test_copyingFrozenChannelOptions_createsUnfrozenCopy()" time="0.0005750656127929688">
        </testcase>
        <testcase classname="ChannelOptionsTests" name="test_copyingFrozenRealtimeChannelOptions_createsUnfrozenCopy()" time="0.0006349086761474609">
        </testcase>
        <testcase classname="ChannelOptionsTests" name="test_copyRealtimeChannelOptions()" time="0.0007210969924926758">
        </testcase>
        <testcase classname="ChannelOptionsTests" name="test_initWithCipherKey_acceptsBase64String()" time="0.000594019889831543">
        </testcase>
        <testcase classname="ChannelOptionsTests" name="test_initWithCipherParamOptions_callsGetDefaultParams()" time="0.0007679462432861328">
        </testcase>
        <testcase classname="ChannelOptionsTests" name="test_initWithInvalidCipherParamOptions_raises()" time="0.0033720731735229492">
        </testcase>
        <testcase classname="ChannelOptionsTests" name="test_realtimeInitWithCipherParamOptions_callsGetDefaultParams()" time="0.0010010004043579102">
        </testcase>
        <testcase classname="ClientInformationTests" name="testAgentIdentifierWithAdditionalAgents_withNilAdditionalAgents()" time="0.001031041145324707">
        </testcase>
        <testcase classname="ClientInformationTests" name="testAgentIdentifierWithAdditionalAgents_withNonNilAdditionalAgents()" time="0.0011739730834960938">
        </testcase>
        <testcase classname="ClientInformationTests" name="testAgents()" time="0.0005120038986206055">
        </testcase>
        <testcase classname="ClientOptionsTests" name="test_copyClientOptions()" time="0.0006010532379150391">
        </testcase>
        <testcase classname="ClientOptionsTests" name="test_defaults()" time="0.0004730224609375">
        </testcase>
        <testcase classname="ConnectRetryStateTests" name="test_addRetryAttempt()" time="0.0005359649658203125">
        </testcase>
        <testcase classname="ConnectRetryStateTests" name="test_transitionToConnectingOrDisconnectedStateDoesNotResetRetrySequence()" time="0.00047910213470458984">
        </testcase>
        <testcase classname="ConnectRetryStateTests" name="test_transitionToNonConnectingOrDisconnectedStateResetsRetrySequence()" time="0.016377925872802734">
        </testcase>
        <testcase classname="CryptoTests" name="test__001__Crypto__getDefaultParams__returns_a_complete_CipherParams_instance__using_the_default_values_for_any_field_not_supplied()" time="0.0009100437164306641">
        </testcase>
        <testcase classname="CryptoTests" name="test__002__Crypto__getDefaultParams__calculates_a_keyLength_from_the_key__its_size_in_bits_()" time="0.0015370845794677734">
        </testcase>
        <testcase classname="CryptoTests" name="test__003__Crypto__getDefaultParams__should_check_that_keyLength_is_valid_for_algorithm()" time="0.0005980730056762695">
        </testcase>
        <testcase classname="CryptoTests" name="test__004__Crypto__getDefaultParams__key_parameter__can_be_a_binary()" time="0.0004400014877319336">
        </testcase>
        <testcase classname="CryptoTests" name="test__005__Crypto__getDefaultParams__key_parameter__can_be_a_base64_encoded_string_with_standard_encoding()" time="0.0004379749298095703">
        </testcase>
        <testcase classname="CryptoTests" name="test__006__Crypto__getDefaultParams__key_parameter__can_be_a_base64_encoded_string_with_URL_encoding()" time="0.007481932640075684">
        </testcase>
        <testcase classname="CryptoTests" name="test__007__Crypto__generateRandomKey__takes_a_single_length_argument_and_returns_a_binary()" time="0.0005880594253540039">
        </testcase>
        <testcase classname="CryptoTests" name="test__008__Crypto__generateRandomKey__takes_no_arguments_and_returns_the_default_algorithm_s_default_length()" time="0.00044798851013183594">
        </testcase>
        <testcase classname="CryptoTests" name="test__009__Crypto__generateHashSHA256__takes_data_and_returns_a_SHA256_digest()" time="0.005365967750549316">
        </testcase>
        <testcase classname="CryptoTests" name="test__010__Crypto__encrypt__should_generate_a_new_IV_every_time_it_s_called__and_should_be_the_first_block_encrypted()" time="0.00067901611328125">
        </testcase>
        <testcase classname="CryptoTests" name="test__011__Crypto__with_fixtures_from_crypto_data_128_json__should_encrypt_messages_as_expected_in_the_fixtures()" time="0.008323907852172852">
        </testcase>
        <testcase classname="CryptoTests" name="test__012__Crypto__with_fixtures_from_crypto_data_128_json__should_decrypt_messages_as_expected_in_the_fixtures()" time="0.004438042640686035">
        </testcase>
        <testcase classname="CryptoTests" name="test__013__Crypto__with_fixtures_from_crypto_data_256_json__should_encrypt_messages_as_expected_in_the_fixtures()" time="0.004155993461608887">
        </testcase>
        <testcase classname="CryptoTests" name="test__014__Crypto__with_fixtures_from_crypto_data_256_json__should_decrypt_messages_as_expected_in_the_fixtures()" time="0.0035729408264160156">
        </testcase>
        <testcase classname="CryptoTests" name="test__015__Crypto__with_fixtures_from_crypto_data_128_json__manual_decrypt_messages_as_expected_in_the_fixtures()" time="0.0034630298614501953">
        </testcase>
        <testcase classname="CryptoTests" name="test__016__Crypto__with_fixtures_from_crypto_data_256_json__manual_decrypt_messages_as_expected_in_the_fixtures()" time="0.022153019905090332">
        </testcase>
        <testcase classname="CryptoTests" name="test__017__Crypto__getDefaultParams__accepts_all_CipherParamOptions_fields()" time="0.0006499290466308594">
        </testcase>
        <testcase classname="CryptoTests" name="test__018__Crypto__getDefaultParams__should_check_that_keyLength_matches_the_key()" time="0.0007849931716918945">
        </testcase>
        <testcase classname="CryptoTests" name="test__019__Crypto__getDefaultParams__should_reject_an_unsupported_mode()" time="0.0005080699920654297">
        </testcase>
        <testcase classname="CryptoTests" name="test__020__CipherParamOptions__stores_a_copy_of_the_key()" time="0.0005490779876708984">
        </testcase>
        <testcase classname="CryptoTests" name="test__021__Crypto__getDefaultParams__should_reject_a_key_that_is_not_valid_base64()" time="0.0006049871444702148">
        </testcase>
        <testcase classname="DefaultErrorCheckerTests" name="test_isTokenError_statusCode401AndCodeBetween40140And40150()" time="0.0027660131454467773">
        </testcase>
        <testcase classname="DefaultErrorCheckerTests" name="test_isTokenError_statusCode401ButCodeGreaterThanOrEqualTo40150()" time="0.0005400180816650391">
        </testcase>
        <testcase classname="DefaultErrorCheckerTests" name="test_isTokenError_statusCode401ButCodeLessThan40140()" time="0.0005090236663818359">
        </testcase>
        <testcase classname="DefaultErrorCheckerTests" name="test_isTokenError_statusCodeNot401()" time="0.0004930496215820312">
        </testcase>
        <testcase classname="DefaultInternalLogCoreTests" name="test_initWithClientOptions_whenClientOptionsLogLevelIsNone()" time="0.0011659860610961914">
        </testcase>
        <testcase classname="DefaultInternalLogCoreTests" name="test_initWithClientOptions_whenClientOptionsLogLevelIsNotNone()" time="0.00049591064453125">
        </testcase>
        <testcase classname="DefaultInternalLogCoreTests" name="test_logLevel()" time="0.0004999637603759766">
        </testcase>
        <testcase classname="DefaultInternalLogCoreTests" name="test_logMessage()" time="0.0011709928512573242">
        </testcase>
        <testcase classname="DefaultInternalLogCoreTests" name="test_setLogLevel()" time="0.024322986602783203">
        </testcase>
        <testcase classname="DefaultJitterCoefficientGeneratorTests" name="test_generatesAVarietyOfValues()" time="0.0007339715957641602">
        </testcase>
        <testcase classname="DefaultJitterCoefficientGeneratorTests" name="test_generatesValuesInExpectedRange()" time="0.000552058219909668">
        </testcase>
        <testcase classname="DeltaCodecTests" name="test__001__withBinaryProtocol_DeltaCodec__decoding__should_decode_vcdiff_encoded_messages()" time="4.905961990356445">
        </testcase>
        <testcase classname="DeltaCodecTests" name="test__001__withoutBinaryProtocol_DeltaCodec__decoding__should_decode_vcdiff_encoded_messages()" time="4.91212797164917">
        </testcase>
        <testcase classname="DeltaCodecTests" name="test__002__DeltaCodec__decoding__should_fail_and_recover_when_the_vcdiff_messages_are_out_of_order()" time="2.254276990890503">
        </testcase>
        <testcase classname="DeltaCodecTests" name="test__003__DeltaCodec__decoding__should_recover_when_the_vcdiff_message_decoding_fails()" time="0.5360549688339233">
        </testcase>
        <testcase classname="DeltaCodecTests" name="test__004__DeltaCodec__decoding__should_ignore_delta_metadata_that_is_not_an_object()" time="0.4800649881362915">
        </testcase>
        <testcase classname="DevicePushDetailsTests" name="test__copy_preserves_state()" time="0.0017470121383666992">
        </testcase>
        <testcase classname="DevicePushDetailsTests" name="test__decodes_active_state()" time="0.0012710094451904297">
        </testcase>
        <testcase classname="DevicePushDetailsTests" name="test__decodes_failed_state()" time="0.0011140108108520508">
        </testcase>
        <testcase classname="DevicePushDetailsTests" name="test__decodes_failing_state()" time="0.0018399953842163086">
        </testcase>
        <testcase classname="DevicePushDetailsTests" name="test__decodes_missing_state_as_unknown()" time="0.0016089677810668945">
        </testcase>
        <testcase classname="DevicePushDetailsTests" name="test__decodes_non_string_state_as_unknown()" time="0.0006430149078369141">
        </testcase>
        <testcase classname="DevicePushDetailsTests" name="test__decodes_state_nested_in_device_details()" time="0.0007520914077758789">
        </testcase>
        <testcase classname="DevicePushDetailsTests" name="test__decodes_unrecognised_state_as_unknown()" time="0.0007710456848144531">
        </testcase>
        <testcase classname="DevicePushDetailsTests" name="test__new_push_details_have_unknown_state()" time="0.0005140304565429688">
        </testcase>
        <testcase classname="DevicePushDetailsTests" name="test__state_is_not_encoded()" time="0.0008819103240966797">
        </testcase>
        <testcase classname="DevicePushDetailsTests" name="test__wire_values_round_trip()" time="0.0015410184860229492">
        </testcase>
        <testcase classname="ErrorInfoTests" name="test__001__ErrorInfo__from_a_system-error__keeps_it_as_the_underlying_error()" time="0.0010499954223632812">
        </testcase>
        <testcase classname="ErrorInfoTests" name="test__002__ErrorInfo__from_a_URL_timeout__has_the_timeout_code()" time="0.0160830020904541">
        </testcase>
        <testcase classname="ErrorInfoTests" name="test__003__ErrorInfo__from_an_Ably_domain_error__keeps_its_code()" time="0.0007979869842529297">
        </testcase>
        <testcase classname="ErrorInfoTests" name="test__004__ErrorInfo__wrap__keeps_the_underlying_error()" time="0.08373701572418213">
        </testcase>
        <testcase classname="ErrorInfoTests" name="test__005__ErrorInfo__cause__returns_an_underlying_ErrorInfo()" time="0.0005970001220703125">
        </testcase>
        <testcase classname="ErrorInfoTests" name="test__006__ErrorInfo__cause__converts_an_underlying_Ably_domain_error()" time="0.0006459951400756836">
        </testcase>
        <testcase classname="HttpAnnotationsTests" name="test__annotation_data_uses_a_cipher_added_by_setOptions_after_channel_creation()" time="0.6846550703048706">
        </testcase>
        <testcase classname="HttpAnnotationsTests" name="test__idempotent_publishing_should_publish_annotation_with_implicit_id_only_once()" time="2.774930000305176">
        </testcase>
        <testcase classname="HttpAnnotationsTests" name="test__publish_annotation_exceeding_max_message_size()" time="0.003677964210510254">
        </testcase>
        <testcase classname="HttpAnnotationsTests" name="test__publish_delete_and_get_annotations()" time="2.77501904964447">
        </testcase>
        <testcase classname="HttpClientChannelTests" name="test__001__publish__should_not_fail_sending_a_message_with_no_clientId_in_the_client_options_and_credentials_that_can_assume_any_clientId()" time="0.4302480220794678">
        </testcase>
        <testcase classname="HttpClientChannelTests" name="test__003__publish__should_publish_the_extras_of_a_Message()" time="0.25224995613098145">
        </testcase>
        <testcase classname="HttpClientChannelTests" name="test__004__publish__should_include_attributes_supplied_by_the_caller_in_the_encoded_message()" time="0.23317599296569824">
        </testcase>
        <testcase classname="HttpClientChannelTests" name="test__005__publish__with_name_and_data_arguments__publishes_the_message_and_invokes_callback_with_success()" time="0.2867840528488159">
        </testcase>
        <testcase classname="HttpClientChannelTests" name="test__006__publish__with_name_only__publishes_the_message_and_invokes_callback_with_success()" time="0.3029160499572754">
        </testcase>
        <testcase classname="HttpClientChannelTests" name="test__007__publish__with_data_only__publishes_the_message_and_invokes_callback_with_success()" time="0.33420801162719727">
        </testcase>
        <testcase classname="HttpClientChannelTests" name="test__008__publish__with_neither_name_nor_data__publishes_the_message_and_invokes_callback_with_success()" time="0.2434539794921875">
        </testcase>
        <testcase classname="HttpClientChannelTests" name="test__009__publish__with_a_Message_object__publishes_the_message_and_invokes_callback_with_success()" time="0.2433929443359375">
        </testcase>
        <testcase classname="HttpClientChannelTests" name="test__010__publish__with_an_array_of_Message_objects__publishes_the_messages_in_a_single_request_and_invokes_callback_with_success()" time="0.364996075630188">
        </testcase>
        <testcase classname="HttpClientChannelTests" name="test__011__publish__Unidentified_clients_using_Basic_Auth__should_publish_message_with_the_provided_clientId()" time="0.27759993076324463">
        </testcase>
        <testcase classname="HttpClientChannelTests" name="test__012__publish__ClientOptions_clientId__should_include_the_clientId_as_a_querystring_parameter_in_realtime_connection_requests()" time="0.3350200653076172">
        </testcase>
        <testcase classname="HttpClientChannelTests" name="test__013__publish__ClientOptions_clientId__should_include_an_X_Ably_ClientId_header_with_value_set_to_the_clientId_as_Base64_encoded_string_in_REST_connection_requests()" time="0.3958810567855835">
        </testcase>
        <testcase classname="HttpClientChannelTests" name="test__014__publish__Message_clientId__publishing_with_no_clientId_when_the_clientId_is_set_to_some_value_in_the_client_options_should_result_in_a_message_received_with_the_clientId_property_set_to_that_value()" time="0.7179409265518188">
        </testcase>
        <testcase classname="HttpClientChannelTests" name="test__015__publish__Message_clientId__publishing_with_a_clientId_set_to_the_same_value_as_the_clientId_in_the_client_options_should_result_in_a_message_received_with_the_clientId_property_set_to_that_value()" time="0.4900599718093872">
        </testcase>
        <testcase classname="HttpClientChannelTests" name="test__016__publish__Message_clientId__publishing_with_a_clientId_set_to_a_value_from_an_unidentified_client_should_result_in_a_message_received_with_the_clientId_property_set_to_that_value()" time="0.49130702018737793">
        </testcase>
        <testcase classname="HttpClientChannelTests" name="test__017__publish__Message_clientId__publishing_with_a_clientId_set_to_a_different_value_from_the_clientId_in_the_client_options_should_result_in_a_message_being_rejected_by_the_server()" time="0.3437459468841553">
        </testcase>
        <testcase classname="HttpClientChannelTests" name="test__018__publish__If_the_total_size_of_message_s__exceeds_the_maxMessageSize__the_client_library_should_reject_the_publish_and_indicate_an_error()" time="0.009869933128356934">
        </testcase>
        <testcase classname="HttpClientChannelTests" name="test__019__publish__If_the_total_size_of_message_s__exceeds_the_maxMessageSize__also_when_using_publish_name_data()" time="0.0039479732513427734">
        </testcase>
        <testcase classname="HttpClientChannelTests" name="test__019a__publish__the_maxMessageSize_is_the_one_in_the_client_options()" time="0.001260995864868164">
        </testcase>
        <testcase classname="HttpClientChannelTests" name="test__020__publish__idempotent_publishing__idempotentRestPublishing_option()" time="0.0025709867477416992">
        </testcase>
        <testcase classname="HttpClientChannelTests" name="test__021__publish__idempotent_publishing__should_not_generate_for_message_with_a_non_empty_id()" time="0.0026139020919799805">
        </testcase>
        <testcase classname="HttpClientChannelTests" name="test__022__publish__idempotent_publishing__should_generate_for_internal_message_that_is_created_in_publish_name_data___method()" time="0.0017969608306884766">
        </testcase>
        <testcase classname="HttpClientChannelTests" name="test__023__publish__idempotent_publishing__should_not_generate_for_multiple_messages_with_a_non_empty_id()" time="0.007923007011413574">
        </testcase>
        <testcase classname="HttpClientChannelTests" name="test__024__publish__idempotent_publishing__should_not_generate_when_idempotentRestPublishing_flag_is_off()" time="0.0013610124588012695">
        </testcase>
        <testcase classname="HttpClientChannelTests" name="test__025__publish__idempotent_publishing__should_have_only_one_published_message()" time="1.0106520652770996">
        </testcase>
        <testcase classname="HttpClientChannelTests" name="test__026__publish__idempotent_publishing__should_publish_a_message_with_implicit_Id_only_once()" time="0.5172380208969116">
        </testcase>
        <testcase classname="HttpClientChannelTests" name="test__027__publish__idempotent_publishing__random_idempotent_publish_id__should_generate_for_one_message_with_empty_id()" time="0.0017299652099609375">
        </testcase>
        <testcase classname="HttpClientChannelTests" name="test__028__publish__idempotent_publishing__random_idempotent_publish_id__should_generate_for_multiple_messages_with_empty_id()" time="0.01338803768157959">
        </testcase>
        <testcase classname="HttpClientChannelTests" name="test__029__history__should_return_a_PaginatedResult_page_containing_the_first_page_of_messages()" time="0.15936493873596191">
        </testcase>
        <testcase classname="HttpClientChannelTests" name="test__030__history__query_arguments__start_and_end_should_filter_messages_between_those_two_times()" time="0.7159299850463867">
        </testcase>
        <testcase classname="HttpClientChannelTests" name="test__031__history__query_arguments__start_must_be_equal_to_or_less_than_end_and_is_unaffected_by_the_request_direction()" time="0.005942940711975098">
        </testcase>
        <testcase classname="HttpClientChannelTests" name="test__032__history__query_arguments__direction_backwards_or_forwards()" time="0.24181091785430908">
        </testcase>
        <testcase classname="HttpClientChannelTests" name="test__033__history__query_arguments__limit_items_result()" time="0.2862589359283447">
        </testcase>
        <testcase classname="HttpClientChannelTests" name="test__034__history__query_arguments__limit_supports_up_to_1000_items()" time="0.001896977424621582">
        </testcase>
        <testcase classname="HttpClientChannelTests" name="test__035__presence__get__should_return_presence_fixture_data()" time="2.056038022041321">
        </testcase>
        <testcase classname="HttpClientChannelTests" name="test__036__message_encoding__payloads_should_be_binary__strings__or_objects_capable_of_JSON_representation()" time="0.8240029811859131">
        </testcase>
        <testcase classname="HttpClientChannelTests" name="test__037__message_encoding__encoding_attribute_should_represent_the_encoding_s__applied_in_right_to_left()" time="0.43296897411346436">
        </testcase>
        <testcase classname="HttpClientChannelTests" name="test__038__message_encoding__json__binary_payload_should_be_encoded_as_Base64_and_represented_as_a_JSON_string()" time="0.15987300872802734">
        </testcase>
        <testcase classname="HttpClientChannelTests" name="test__039__message_encoding__json__string_payload_should_be_represented_as_a_JSON_string()" time="0.16726195812225342">
        </testcase>
        <testcase classname="HttpClientChannelTests" name="test__040__message_encoding__json__messages_received_should_be_decoded_based_on_the_encoding_field()" time="0.665800929069519">
        </testcase>
        <testcase classname="HttpClientChannelTests" name="test__041__message_encoding__json__json_payload_should_be_stringified_either__as_a_JSON_Array()" time="0.177528977394104">
        </testcase>
        <testcase classname="HttpClientChannelTests" name="test__042__message_encoding__json__json_payload_should_be_stringified_either__as_a_JSON_Object()" time="0.5303019285202026">
        </testcase>
        <testcase classname="HttpClientChannelTests" name="test__043__message_payload_encryption__should_support_AES_encryption__128_CBC_mode()" time="0.26516401767730713">
        </testcase>
        <testcase classname="HttpClientChannelTests" name="test__044__message_payload_encryption__should_support_AES_encryption__256_CBC_mode()" time="0.2799140214920044">
        </testcase>
        <testcase classname="HttpClientChannelTests" name="test__045__message_decoding__should_deliver_with_a_binary_payload_when_the_payload_was_successfully_decoded_but_it_could_not_be_decrypted()" time="0.4248579740524292">
        </testcase>
        <testcase classname="HttpClientChannelTests" name="test__046__message_decoding__should_deliver_with_encoding_attribute_set_indicating_the_residual_encoding_and_error_should_be_emitted()" time="0.26077401638031006">
        </testcase>
        <testcase classname="HttpClientChannelTests" name="test__047__status__with_subscribers__returns_a_channel_details_object_populated_with_channel_metrics()" time="0.5728870630264282">
        </testcase>
        <testcase classname="HttpClientChannelTests" name="test__48__channel_name_can_contain_slash_character_which_is_url_encoded_in_the_rest_request_path()" time="0.0017850399017333984">
        </testcase>
        <testcase classname="HttpClientChannelTests" name="test__49__publish__with_resultCallback__returns_valid_PublishResult_with_message_serials()" time="0.18539190292358398">
        </testcase>
        <testcase classname="HttpClientChannelsTests" name="test__001__RestClient__channels__should_return_collection_of_channels()" time="0.0014139413833618164">
        </testcase>
        <testcase classname="HttpClientChannelsTests" name="test__002__RestClient__channels__should_be_enumerable()" time="0.002043008804321289">
        </testcase>
        <testcase classname="HttpClientChannelsTests" name="test__003__RestClient__channels__get__should_return_a_channel()" time="0.0015530586242675781">
        </testcase>
        <testcase classname="HttpClientChannelsTests" name="test__004__RestClient__channels__get__should_return_a_channel_with_the_provided_options()" time="0.0009419918060302734">
        </testcase>
        <testcase classname="HttpClientChannelsTests" name="test__005__RestClient__channels__get__should_not_replace_the_options_on_an_existing_channel_when_none_are_provided()" time="0.000677943229675293">
        </testcase>
        <testcase classname="HttpClientChannelsTests" name="test__006__RestClient__channels__get__should_replace_the_options_on_an_existing_channel_when_new_ones_are_provided()" time="0.0012420415878295898">
        </testcase>
        <testcase classname="HttpClientChannelsTests" name="test__007__RestClient__channels__channelExists__should_check_if_a_channel_exists()" time="0.0008730888366699219">
        </testcase>
        <testcase classname="HttpClientChannelsTests" name="test__008__RestClient__channels__releaseChannel__should_release_a_channel()" time="0.00636899471282959">
        </testcase>
        <testcase classname="HttpClientPresenceTests" name="test__001__Presence__presence_messages_retrieved_are_decoded_in_the_same_way_that_messages_are_decoded()" time="0.7257289886474609">
        </testcase>
        <testcase classname="HttpClientPresenceTests" name="test__002__Presence__get__should_return_a_PaginatedResult_page_containing_the_first_page_of_members()" time="75.41468107700348">
        </testcase>
        <testcase classname="HttpClientPresenceTests" name="test__003__Presence__get__limit_should_support_up_to_1000_items()" time="0.01947498321533203">
        </testcase>
        <testcase classname="HttpClientPresenceTests" name="test__004__Presence__get__clientId_should_filter_members_by_the_provided_clientId()" time="0.6149249076843262">
        </testcase>
        <testcase classname="HttpClientPresenceTests" name="test__005__Presence__get__connectionId_should_filter_members_by_the_provided_connectionId()" time="4.458644986152649">
        </testcase>
        <testcase classname="HttpClientPresenceTests" name="test__006__Presence__history__should_return_a_PaginatedResult_page_containing_the_first_page_of_members()" time="75.34457004070282">
        </testcase>
        <testcase classname="HttpClientPresenceTests" name="test__007__Presence__history__query_argument__direction_should_change_the_order_of_the_members()" time="5.151360034942627">
        </testcase>
        <testcase classname="HttpClientPresenceTests" name="test__008__Presence__history__connectionId_should_filter_members_by_the_provided_connectionId()" time="4.462364912033081">
        </testcase>
        <testcase classname="HttpClientPresenceTests" name="test__009__Presence__history__query_argument__limit_supports_up_to_1000_members()" time="0.5364149808883667">
        </testcase>
        <testcase classname="HttpClientPresenceTests" name="test__010__Presence__history__query_argument__start_and_end_should_filter_members_between_those_two_times()" time="20.628589987754822">
        </testcase>
        <testcase classname="HttpClientPresenceTests" name="test__011__Presence__history__query_argument__start_must_be_equal_to_or_less_than_end_and_is_unaffected_by_the_request_direction()" time="0.006836056709289551">
        </testcase>
        <testcase classname="HttpClientStatsTests" name="test__001__RestClient__stats__result__should_match_minute_level_inbound_and_outbound_fixture_data__forwards_()" time="2.62778103351593">
        </testcase>
        <testcase classname="HttpClientStatsTests" name="test__002__RestClient__stats__result__should_match_hour_level_inbound_and_outbound_fixture_data__forwards_()" time="2.5605419874191284">
        </testcase>
        <testcase classname="HttpClientStatsTests" name="test__003__RestClient__stats__result__should_match_day_level_inbound_and_outbound_fixture_data__forwards_()" time="2.5108050107955933">
        </testcase>
        <testcase classname="HttpClientStatsTests" name="test__004__RestClient__stats__result__should_match_month_level_inbound_and_outbound_fixture_data__forwards_()" time="2.5549010038375854">
        </testcase>
        <testcase classname="HttpClientStatsTests" name="test__005__RestClient__stats__result__should_contain_only_one_item_when_limit_is_1__backwards()" time="2.7160799503326416">
        </testcase>
        <testcase classname="HttpClientStatsTests" name="test__006__RestClient__stats__result__should_contain_only_one_item_when_limit_is_1__forwards()" time="2.39833402633667">
        </testcase>
        <testcase classname="HttpClientStatsTests" name="test__007__RestClient__stats__result__should_be_paginated_according_to_the_limit__backwards()" time="2.656136989593506">
        </testcase>
        <testcase classname="HttpClientStatsTests" name="test__008__RestClient__stats__result__should_be_paginated_according_to_the_limit__fowards_()" time="2.981053948402405">
        </testcase>
        <testcase classname="HttpClientStatsTests" name="test__009__RestClient__stats__query__start__should_raise_when_later_than_end()" time="0.0025430917739868164">
        </testcase>
        <testcase classname="HttpClientStatsTests" name="test__010__RestClient__stats__query__direction__should_be_backwards_by_default()" time="0.0006259679794311523">
        </testcase>
        <testcase classname="HttpClientStatsTests" name="test__011__RestClient__stats__query__limit__should_have_a_default_value_of_100()" time="0.0004590749740600586">
        </testcase>
        <testcase classname="HttpClientStatsTests" name="test__012__RestClient__stats__query__limit__should_raise_when_greater_than_1000()" time="0.0012160539627075195">
        </testcase>
        <testcase classname="HttpClientStatsTests" name="test__013__RestClient__stats__query__unit__should_default_to_minute()" time="0.0005689859390258789">
        </testcase>
        <testcase classname="HttpClientStatsTests" name="test__014__RestClient__stats__query__start__should_not_raise_when_end_is_not_set()" time="0.0013780593872070312">
        </testcase>
        <testcase classname="HttpClientTests" name="test__001__RestClient__All_REST_requests_should_include_the_current_API_version()" time="0.1714550256729126">
        </testcase>
        <testcase classname="HttpClientTests" name="test__002__RestClient__should_provide_access_to_the_AuthOptions_object_passed_in_ClientOptions()" time="0.0014030933380126953">
        </testcase>
        <testcase classname="HttpClientTests" name="test__003__RestClient__REST_endpoint_host_should_be_configurable_in_the_Client_constructor_with_the_option_endpoint()" time="0.024742960929870605">
        </testcase>
        <testcase classname="HttpClientTests" name="test__004__RestClient__should_send_requests_over_http_and_https()" time="0.3609050512313843">
        </testcase>
        <testcase classname="HttpClientTests" name="test__005__RestClient__should_use_Auth_to_manage_authentication()" time="0.19363296031951904">
        </testcase>
        <testcase classname="HttpClientTests" name="test__006__RestClient__should_request_another_token_after_current_one_is_no_longer_valid()" time="1.6222490072250366">
        </testcase>
        <testcase classname="HttpClientTests" name="test__007__RestClient__should_result_in_an_error_when_user_does_not_have_sufficient_permissions()" time="0.3320239782333374">
        </testcase>
        <testcase classname="HttpClientTests" name="test__008__RestClient__should_use_MsgPack_binary_protocol()" time="0.5068780183792114">
        </testcase>
        <testcase classname="HttpClientTests" name="test__009__RestClient__should_use_JSON_text_protocol()" time="0.4901930093765259">
        </testcase>
        <testcase classname="HttpClientTests" name="test__010__RestClient__X_Ably_Version_must_be_included_in_all_REST_requests()" time="0.16560494899749756">
        </testcase>
        <testcase classname="HttpClientTests" name="test__011__RestClient__The_Agent_library_identifier_is_composed_of_a_series_of_key__value__entries_joined_by_spaces()" time="0.17919206619262695">
        </testcase>
        <testcase classname="HttpClientTests" name="test__012__RestClient__should_indicate_an_error_if_there_is_no_way_to_renew_the_token()" time="2.554616928100586">
        </testcase>
        <testcase classname="HttpClientTests" name="test__013__RestClient__background_behaviour()" time="0.8177969455718994">
        </testcase>
        <testcase classname="HttpClientTests" name="test__014__RestClient__client_should_handle_error_messages_in_plaintext_and_HTML_format()" time="0.060984015464782715">
        </testcase>
        <testcase classname="HttpClientTests" name="test__015__RestClient__initializer__should_accept_an_API_key()" time="0.0020639896392822266">
        </testcase>
        <testcase classname="HttpClientTests" name="test__016__RestClient__initializer__should_throw_when_provided_an_invalid_key()" time="0.0015999078750610352">
        </testcase>
        <testcase classname="HttpClientTests" name="test__017__RestClient__initializer__should_result_in_error_status_when_provided_a_bad_key()" time="0.16603994369506836">
        </testcase>
        <testcase classname="HttpClientTests" name="test__018__RestClient__initializer__should_accept_a_token()" time="0.17594993114471436">
        </testcase>
        <testcase classname="HttpClientTests" name="test__019__RestClient__initializer__should_accept_an_options_object()" time="0.005694985389709473">
        </testcase>
        <testcase classname="HttpClientTests" name="test__020__RestClient__initializer__should_accept_an_options_object_with_token_authentication()" time="0.1701129674911499">
        </testcase>
        <testcase classname="HttpClientTests" name="test__021__RestClient__initializer__should_result_in_error_status_when_provided_a_bad_token()" time="0.15403294563293457">
        </testcase>
        <testcase classname="HttpClientTests" name="test__022__RestClient__logging__should_output_to_the_system-log_and_the_log_level_should_be_Warn()" time="0.0017549991607666016">
        </testcase>
        <testcase classname="HttpClientTests" name="test__023__RestClient__logging__should_have_a_mutable_log_level()" time="0.002375960350036621">
        </testcase>
        <testcase classname="HttpClientTests" name="test__024__RestClient__logging__should_accept_a_custom_logger()" time="0.0011219978332519531">
        </testcase>
        <testcase classname="HttpClientTests" name="test__025__RestClient__endpoint__should_accept_a_custom_host_and_send_requests_to_the_specified_host()" time="0.013655900955200195">
        </testcase>
        <testcase classname="HttpClientTests" name="test__026__RestClient__endpoint__should_send_requests_to_the_production_routing_policy_host()" time="0.013064980506896973">
        </testcase>
        <testcase classname="HttpClientTests" name="test__027__RestClient__endpoint__should_send_requests_to_the_nonprod_routing_policy_host()" time="0.014316916465759277">
        </testcase>
        <testcase classname="HttpClientTests" name="test__028__RestClient__endpoint__should_default_to_https___main_realtime_ably_net()" time="0.013152003288269043">
        </testcase>
        <testcase classname="HttpClientTests" name="test__028a__RestClient__endpoint__an_empty_endpoint_means_the_default()" time="0.0009779930114746094">
        </testcase>
        <testcase classname="HttpClientTests" name="test__029__RestClient__endpoint__should_connect_over_plain_http____when_tls_is_off()" time="0.15658509731292725">
        </testcase>
        <testcase classname="HttpClientTests" name="test__031__RestClient__should_use_the_the_connection_and_request_timeouts_specified__timeout_for_any_single_HTTP_request_and_response()" time="1.0154399871826172">
        </testcase>
        <testcase classname="HttpClientTests" name="test__032__RestClient__should_use_the_the_connection_and_request_timeouts_specified__max_number_of_fallback_hosts()" time="0.004029989242553711">
        </testcase>
        <testcase classname="HttpClientTests" name="test__033__RestClient__should_use_the_the_connection_and_request_timeouts_specified__max_elapsed_time_in_which_fallback_host_retries_for_HTTP_requests_will_be_attempted()" time="0.4371730089187622">
        </testcase>
        <testcase classname="HttpClientTests" name="test__034__RestClient__time__should_return_server_time()" time="0.15306007862091064">
        </testcase>
        <testcase classname="HttpClientTests" name="test__035__RestClient__Authentication__should_support_basic_authentication_when_an_API_key_is_provided_with_the_key_option()" time="0.1589350700378418">
        </testcase>
        <testcase classname="HttpClientTests" name="test__038__RestClient__Authentication__basic_authentication_flag__should_be_true_when_initialized_with_a_key()" time="0.0008360147476196289">
        </testcase>
        <testcase classname="HttpClientTests" name="test__039__RestClient__Authentication__basic_authentication_flag__should_be_false_when_options__useTokenAuth_is_set()" time="0.0007779598236083984">
        </testcase>
        <testcase classname="HttpClientTests" name="test__040__RestClient__Authentication__basic_authentication_flag__should_be_false_when_options__authUrl_is_set()" time="0.0008029937744140625">
        </testcase>
        <testcase classname="HttpClientTests" name="test__041__RestClient__Authentication__basic_authentication_flag__should_be_false_when_options__authCallback_is_set()" time="0.000764012336730957">
        </testcase>
        <testcase classname="HttpClientTests" name="test__042__RestClient__Authentication__basic_authentication_flag__should_be_false_when_options__tokenDetails_is_set()" time="0.0012439489364624023">
        </testcase>
        <testcase classname="HttpClientTests" name="test__043__RestClient__Authentication__basic_authentication_flag__should_be_false_when_options__token_is_set()" time="0.0007359981536865234">
        </testcase>
        <testcase classname="HttpClientTests" name="test__044__RestClient__Authentication__basic_authentication_flag__should_be_false_when_options__key_is_set()" time="0.0006269216537475586">
        </testcase>
        <testcase classname="HttpClientTests" name="test__045__RestClient__Host_Fallback__failing_HTTP_requests_with_custom_endpoint_should_result_in_an_error_immediately()" time="0.0016189813613891602">
        </testcase>
        <testcase classname="HttpClientTests" name="test__047__RestClient__Host_Fallback__won_t_apply_fallback_hosts_if_ClientOptions_fallbackHosts_array_is_empty()" time="0.0015050172805786133">
        </testcase>
        <testcase classname="HttpClientTests" name="test__048__RestClient__Host_Fallback__won_t_apply_custom_fallback_hosts_if_ClientOptions_fallbackHosts_and_ClientOptions_endpoint_are_not_set__use_defaults_instead()" time="0.007567048072814941">
        </testcase>
        <testcase classname="HttpClientTests" name="test__049__RestClient__Host_Fallback__every_new_HTTP_request_is_first_attempted_to_the_default_primary_host()" time="1.1754069328308105">
        </testcase>
        <testcase classname="HttpClientTests" name="test__050__RestClient__Host_Fallback__should_not_use_an_alternative_host_when_the_client_receives_an_bad_request()" time="0.0013450384140014648">
        </testcase>
        <testcase classname="HttpClientTests" name="test__055__RestClient__Host_Fallback__Fallback_behavior__should_be_applied_when_endpoint__port_and_tlsPort_has_not_been_set_to_an_explicit_value()" time="0.0013070106506347656">
        </testcase>
        <testcase classname="HttpClientTests" name="test__056__RestClient__Host_Fallback__Fallback_behavior__should_NOT_be_applied_when_ClientOptions_endpoint_is_a_hostname()" time="0.001159071922302246">
        </testcase>
        <testcase classname="HttpClientTests" name="test__057__RestClient__Host_Fallback__Fallback_behavior__should_NOT_be_applied_when_ClientOptions_port_has_been_set()" time="0.0011470317840576172">
        </testcase>
        <testcase classname="HttpClientTests" name="test__058__RestClient__Host_Fallback__Fallback_behavior__should_NOT_be_applied_when_ClientOptions_tlsPort_has_been_set()" time="0.002835988998413086">
        </testcase>
        <testcase classname="HttpClientTests" name="test__059__RestClient__Host_Fallback__Fallback_behavior__should_be_applied_when_ClientOptions_fallbackHosts_is_provided()" time="0.0012159347534179688">
        </testcase>
        <testcase classname="HttpClientTests" name="test__061__RestClient__Host_Fallback__fallback_hosts_list_and_priorities__should_use_ClientOptions_fallbackHosts_when_list_is_provided()" time="0.0022389888763427734">
        </testcase>
        <testcase classname="HttpClientTests" name="test__062__RestClient__Host_Fallback__fallback_hosts_list_and_priorities__should_use_nonprod_fallback_hosts_when_ClientOptions_endpoint_is_a_nonprod_routing_policy_and_ClientOptions_fallbackHosts_is_not_set()" time="0.0035489797592163086">
        </testcase>
        <testcase classname="HttpClientTests" name="test__063__RestClient__Host_Fallback__fallback_hosts_list_and_priorities__should_use_routing_policy_fallback_hosts_when_ClientOptions_endpoint_is_a_production_routing_policy()" time="0.002497076988220215">
        </testcase>
        <testcase classname="HttpClientTests" name="test__064__RestClient__Host_Fallback__fallback_hosts_list_and_priorities__should_use_default_fallback_hosts_when_both_ClientOptions_fallbackHosts_and_ClientOptions_endpoint_are_not_set()" time="0.0013210773468017578">
        </testcase>
        <testcase classname="HttpClientTests" name="test__065__RestClient__Host_Fallback__retry_hosts_in_random_order__default_fallback_hosts_should_match_main__a_e__fallback_ably_realtime_com()" time="0.0030590295791625977">
        </testcase>
        <testcase classname="HttpClientTests" name="test__066__RestClient__Host_Fallback__retry_hosts_in_random_order__routing_policy_fallback_hosts_have_the_format__id___a_e__fallback()" time="0.0005561113357543945">
        </testcase>
        <testcase classname="HttpClientTests" name="test__066b__RestClient__Host_Fallback__an_endpoint_that_is_a_hostname_is_used_as_is_and_has_no_fallback_hosts()" time="0.0004500150680541992">
        </testcase>
        <testcase classname="HttpClientTests" name="test__067__RestClient__Host_Fallback__retry_hosts_in_random_order__until_httpMaxRetryCount_has_been_reached()" time="0.0018759965896606445">
        </testcase>
        <testcase classname="HttpClientTests" name="test__068__RestClient__Host_Fallback__retry_hosts_in_random_order__use_custom_fallback_hosts_if_set()" time="0.001622915267944336">
        </testcase>
        <testcase classname="HttpClientTests" name="test__069__RestClient__Host_Fallback__retry_hosts_in_random_order__until_all_fallback_hosts_have_been_tried()" time="0.0043419599533081055">
        </testcase>
        <testcase classname="HttpClientTests" name="test__070__RestClient__Host_Fallback__retry_hosts_in_random_order__until_httpMaxRetryCount_has_been_reached__if_custom_fallback_hosts_are_provided_in_ClientOptions_fallbackHosts__then_they_will_be_used_instead()" time="0.0018039941787719727">
        </testcase>
        <testcase classname="HttpClientTests" name="test__071__RestClient__Host_Fallback__retry_hosts_in_random_order__until_all_fallback_hosts_have_been_tried__if_custom_fallback_hosts_are_provided_in_ClientOptions_fallbackHosts__then_they_will_be_used_instead()" time="0.0017839670181274414">
        </testcase>
        <testcase classname="HttpClientTests" name="test__072__RestClient__Host_Fallback__retry_hosts_in_random_order__all_fallback_requests_headers_should_contain__Host__header_with_fallback_host_address()" time="0.0014760494232177734">
        </testcase>
        <testcase classname="HttpClientTests" name="test__073__RestClient__Host_Fallback__retry_hosts_in_random_order__if_an_empty_array_of_fallback_hosts_is_provided__then_fallback_host_functionality_is_disabled()" time="0.0012649297714233398">
        </testcase>
        <testcase classname="HttpClientTests" name="test__074__RestClient__Host_Fallback__should_use_an_alternative_host_when___hostUnreachable()" time="0.002873063087463379">
        </testcase>
        <testcase classname="HttpClientTests" name="test__075__RestClient__Host_Fallback__should_use_an_alternative_host_when___requestTimeout_timeout__0_1_()" time="0.11126995086669922">
        </testcase>
        <testcase classname="HttpClientTests" name="test__076__RestClient__Host_Fallback__should_use_an_alternative_host_when___hostInternalError_code__501_()" time="0.0014880895614624023">
        </testcase>
        <testcase classname="HttpClientTests" name="test__077__RestClient__Host_Fallback__should_store_successful_fallback_host_as_default_host___hostUnreachable()" time="0.001448988914489746">
        </testcase>
        <testcase classname="HttpClientTests" name="test__078__RestClient__Host_Fallback__should_store_successful_fallback_host_as_default_host___requestTimeout_timeout__0_1_()" time="0.10473299026489258">
        </testcase>
        <testcase classname="HttpClientTests" name="test__079__RestClient__Host_Fallback__should_store_successful_fallback_host_as_default_host___hostInternalError_code__501_()" time="0.0016770362854003906">
        </testcase>
        <testcase classname="HttpClientTests" name="test__080__RestClient__Host_Fallback__should_store_successful_fallback_host_as_default_host__should_restore_default_primary_host_after_fallbackRetryTimeout_expired___hostUnreachable()" time="1.1229709386825562">
        </testcase>
        <testcase classname="HttpClientTests" name="test__081__RestClient__Host_Fallback__should_store_successful_fallback_host_as_default_host__should_restore_default_primary_host_after_fallbackRetryTimeout_expired___requestTimeout_timeout__0_1_()" time="1.2342259883880615">
        </testcase>
        <testcase classname="HttpClientTests" name="test__082__RestClient__Host_Fallback__should_store_successful_fallback_host_as_default_host__should_restore_default_primary_host_after_fallbackRetryTimeout_expired___hostInternalError_code__501_()" time="1.130782961845398">
        </testcase>
        <testcase classname="HttpClientTests" name="test__083__RestClient__Host_Fallback__should_store_successful_fallback_host_as_default_host__should_use_another_fallback_host_if_previous_fallback_request_failed_and_store_it_as_default_if_current_fallback_request_succseeded___hostUnreachable()" time="0.014729022979736328">
        </testcase>
        <testcase classname="HttpClientTests" name="test__084__RestClient__Host_Fallback__should_store_successful_fallback_host_as_default_host__should_use_another_fallback_host_if_previous_fallback_request_failed_and_store_it_as_default_if_current_fallback_request_succseeded___requestTimeout_timeout__0_1_()" time="0.2117140293121338">
        </testcase>
        <testcase classname="HttpClientTests" name="test__085__RestClient__Host_Fallback__should_store_successful_fallback_host_as_default_host__should_use_another_fallback_host_if_previous_fallback_request_failed_and_store_it_as_default_if_current_fallback_request_succseeded___hostInternalError_code__501_()" time="0.0082169771194458">
        </testcase>
        <testcase classname="HttpClientTests" name="test__086__RestClient__request__method_signature_and_arguments__should_add_query_parameters()" time="0.0036100149154663086">
        </testcase>
        <testcase classname="HttpClientTests" name="test__087__RestClient__request__method_signature_and_arguments__should_add_a_HTTP_body()" time="0.0018390417098999023">
        </testcase>
        <testcase classname="HttpClientTests" name="test__088__RestClient__request__method_signature_and_arguments__should_add_a_HTTP_header()" time="0.0011539459228515625">
        </testcase>
        <testcase classname="HttpClientTests" name="test__089__RestClient__request__method_signature_and_arguments__should_raise_if_method_is_invalid()" time="0.001435995101928711">
        </testcase>
        <testcase classname="HttpClientTests" name="test__090__RestClient__request__method_signature_and_arguments__should_raise_if_path_is_invalid()" time="0.0009980201721191406">
        </testcase>
        <testcase classname="HttpClientTests" name="test__091__RestClient__request__method_signature_and_arguments__should_raise_if_body_is_not_a_Dictionary_or_an_Array()" time="0.0008530616760253906">
        </testcase>
        <testcase classname="HttpClientTests" name="test__092__RestClient__request__method_signature_and_arguments__should_do_a_request_and_receive_a_valid_response()" time="0.31904399394989014">
        </testcase>
        <testcase classname="HttpClientTests" name="test__093__RestClient__request__method_signature_and_arguments__should_handle_response_failures()" time="0.324429988861084">
        </testcase>
        <testcase classname="HttpClientTests" name="test__094__RestClient__if_in_the_course_of_a_REST_request_an_attempt_to_authenticate_using_authUrl_fails_due_to_a_timeout__the_request_should_result_in_an_error_with_code_40170__statusCode_401__and_a_suitable_error_message()" time="3.160390019416809">
        </testcase>
        <testcase classname="HttpClientTests" name="test__095__RestClient__request_IDs__should_add__request_id__query_parameter()" time="0.00451207160949707">
        </testcase>
        <testcase classname="HttpClientTests" name="test__096__RestClient__request_IDs__should_remain_the_same_if_a_request_is_retried_to_a_fallback_host()" time="0.015501022338867188">
        </testcase>
        <testcase classname="HttpClientTests" name="test__097__RestClient__request_IDs__ErrorInfo_should_have__requestId__property()" time="0.0013799667358398438">
        </testcase>
        <testcase classname="HttpPaginatedTests" name="test__001__RestPaginated__should_extract_links_from_the_response()" time="0.0024880170822143555">
        </testcase>
        <testcase classname="HttpPaginatedTests" name="test__002__RestPaginated__should_create_next_first_last_request_from_extracted_link_path()" time="0.0011749267578125">
        </testcase>
        <testcase classname="LocalDeviceStorageTests" name="test_atomicUpdateWritesAllKeysInOneFlush()" time="0.019698023796081543">
        </testcase>
        <testcase classname="LocalDeviceStorageTests" name="test_batchUpdateDoesNotReachDiskMidBatch()" time="0.012866973876953125">
        </testcase>
        <testcase classname="LocalDeviceStorageTests" name="test_discardsLegacyDataWhenKeychainSecretIsUnavailable()" time="0.019253969192504883">
        </testcase>
        <testcase classname="LocalDeviceStorageTests" name="test_migratesLegacyUserDefaultsOnFirstInit()" time="0.008980989456176758">
        </testcase>
        <testcase classname="LocalDeviceStorageTests" name="test_RSH3h_stateMachineConstructionLoadsTheDeviceWhenNotPreloaded()" time="0.002458930015563965">
        </testcase>
        <testcase classname="LocalDeviceStorageTests" name="test_RSH8a_RSH3h_persistedActivationStateDiscardedWhenDeviceDataIsIncomplete()" time="0.004938006401062012">
        </testcase>
        <testcase classname="LocalDeviceStorageTests" name="test_RSH8a_RSH3h_persistedActivationStateResumesWhenDeviceDataIsComplete()" time="0.004432082176208496">
        </testcase>
        <testcase classname="LocalDeviceStorageTests" name="test_storageFileIsCreated()" time="0.0031260251998901367">
        </testcase>
        <testcase classname="LocalDeviceStorageTests" name="test_writesAndReadsThroughTheProtocol()" time="0.0029680728912353516">
        </testcase>
        <testcase classname="LogAdapterTests" name="test_logLevel()" time="0.0005089044570922852">
        </testcase>
        <testcase classname="LogAdapterTests" name="test_logMessage()" time="0.0005739927291870117">
        </testcase>
        <testcase classname="LogAdapterTests" name="test_setLogLevel()" time="0.0004949569702148438">
        </testcase>
        <testcase classname="MessageUpdatesDeletesTests" name="test__RSL11__getMessage()" time="1.3949300050735474">
        </testcase>
        <testcase classname="MessageUpdatesDeletesTests" name="test__RSL15__appendMessage()" time="1.4932279586791992">
        </testcase>
        <testcase classname="MessageUpdatesDeletesTests" name="test__RSL15__deleteMessage()" time="1.4986649751663208">
        </testcase>
        <testcase classname="MessageUpdatesDeletesTests" name="test__RSL15__RSL14__updateMessage__and__getMessageVersions()" time="2.57110595703125">
        </testcase>
        <testcase classname="MessageUpdatesDeletesTests" name="test__RTL28__getMessage()" time="1.6458709239959717">
        </testcase>
        <testcase classname="MessageUpdatesDeletesTests" name="test__RTL32__appendMessage()" time="1.7434839010238647">
        </testcase>
        <testcase classname="MessageUpdatesDeletesTests" name="test__RTL32__deleteMessage()" time="1.8115869760513306">
        </testcase>
        <testcase classname="MessageUpdatesDeletesTests" name="test__RTL32__RTL31__updateMessage__and__getMessageVersions()" time="2.8689019680023193">
        </testcase>
        <testcase classname="MessageUpdatesDeletesTests" name="test_subscribeToAppends()" time="1.6373220682144165">
        </testcase>
        <testcase classname="ObjectLifetimesTests" name="test__001__ObjectLifetimes__user_code_releases_public_object__the_object_s_internal_child_s_back_reference_is_released_too()" time="0.014580965042114258">
        </testcase>
        <testcase classname="ObjectLifetimesTests" name="test__002__ObjectLifetimes__user_code_holds_only_reference_to_public_object_s_public_child__still_can_access_parent_s_internal_object()" time="0.001529097557067871">
        </testcase>
        <testcase classname="ObjectLifetimesTests" name="test__003__ObjectLifetimes__user_code_holds_only_reference_to_public_object_s_public_child__when_it_s_released__schedules_async_release_of_parent_s_internal_object_in_internal_queue()" time="0.0014399290084838867">
        </testcase>
        <testcase classname="ObjectLifetimesTests" name="test__004__ObjectLifetimes__when_user_leaves_Realtime_open__still_works()" time="0.4664790630340576">
        </testcase>
        <testcase classname="ObjectLifetimesTests" name="test__005__ObjectLifetimes__when_Realtime_is_closed_and_user_loses_its_reference__channels_don_t_leak()" time="0.3794870376586914">
        </testcase>
        <testcase classname="PluginAPITests" name="test_channelAttachedNotifiesPlugin()" time="0.3514519929885864">
        </testcase>
        <testcase classname="PluginAPITests" name="test_channelStateChangeNotifiesPlugin()" time="0.3313230276107788">
        </testcase>
        <testcase classname="PluginAPITests" name="test_connectionDetailsCallbackOnConnected()" time="0.2444310188293457">
        </testcase>
        <testcase classname="PluginAPITests" name="test_fetchServerTime()" time="0.1542590856552124">
        </testcase>
        <testcase classname="PluginAPITests" name="test_latestConnectionDetails()" time="0.24898695945739746">
        </testcase>
        <testcase classname="PluginAPITests" name="test_sendObject()" time="0.31508803367614746">
        </testcase>
        <testcase classname="PubSubDeviceTests" name="test__001__createClient__declares_the_device_agent_without_a_version()" time="0.0015479326248168945">
        </testcase>
        <testcase classname="PubSubDeviceTests" name="test__002__createClient__leaves_the_callers_options_untouched()" time="0.003801107406616211">
        </testcase>
        <testcase classname="PubSubDeviceTests" name="test__003__createClient__preserves_agents_supplied_by_the_caller()" time="0.0013079643249511719">
        </testcase>
        <testcase classname="PubSubDeviceTests" name="test__004__createClient__the_declaration_wins_over_a_caller_entry_of_the_same_name()" time="0.0018689632415771484">
        </testcase>
        <testcase classname="PubSubDeviceTests" name="test__005__createClient__carries_over_the_rest_of_the_options()" time="0.0017399787902832031">
        </testcase>
        <testcase classname="PubSubDeviceTests" name="test__006__createClient__accepts_a_key()" time="0.0019960403442382812">
        </testcase>
        <testcase classname="PubSubDeviceTests" name="test__007__createClient__accepts_a_token()" time="0.0016380548477172852">
        </testcase>
        <testcase classname="PubSubDeviceTests" name="test__008__createClient__sends_the_declaration_on_the_realtime_connection()" time="0.24810492992401123">
        </testcase>
        <testcase classname="PubSubDeviceTests" name="test__009__createClient__sends_the_declaration_on_http_requests()" time="0.15161991119384766">
        </testcase>
        <testcase classname="PubSubDeviceTests" name="test__010__the_core_constructor__declares_nothing()" time="0.0017720460891723633">
        </testcase>
        <testcase classname="PubSubDeviceTests" name="test__011__createClient__carries_over_the_plugins()" time="0.02105391025543213">
        </testcase>
        <testcase classname="PubSubDeviceTests" name="test__011__createClient__the_full_agent_identifier()" time="0.002157926559448242">
        </testcase>
        <testcase classname="PushActivationStateMachineTests" name="test__001__should_remove_identityTokenDetails_from_cache_and_storage()" time="0.0022770166397094727">
        </testcase>
        <testcase classname="PushActivationStateMachineTests" name="test__002__Activation_state_machine__should_set_NotActivated_state_as_current_state_when_disk_is_empty()" time="0.004027009010314941">
        </testcase>
        <testcase classname="PushActivationStateMachineTests" name="test__003__Activation_state_machine__should_read_the_current_state_from_disk()" time="0.006522059440612793">
        </testcase>
        <testcase classname="PushActivationStateMachineTests" name="test__004__Activation_state_machine__AfterRegistrationUpdateFailed_state_from_persistence_gets_migrated_to_AfterRegistrationSyncFailed()" time="0.0034170150756835938">
        </testcase>
        <testcase classname="PushActivationStateMachineTests" name="test__005__Activation_state_machine__should_queue_event_that_has_no_transition_defined_for_it()" time="0.011812925338745117">
        </testcase>
        <testcase classname="PushActivationStateMachineTests" name="test__006__Activation_state_machine__event_handling_sould_be_atomic_and_sequential()" time="0.0014159679412841797">
        </testcase>
        <testcase classname="PushActivationStateMachineTests" name="test__007__Activation_state_machine__State_NotActivated__on_Event_CalledDeactivate__should_transition_to_NotActivated()" time="0.0016989707946777344">
        </testcase>
        <testcase classname="PushActivationStateMachineTests" name="test__008__Activation_state_machine__State_NotActivated__on_Event_GotPushDeviceDetails()" time="0.001181960105895996">
        </testcase>
        <testcase classname="PushActivationStateMachineTests" name="test__009__Activation_state_machine__State_NotActivated__on_Event_CalledActivate__if_the_local_device_has_the_necessary_push_details_should_send_event_GotPushDeviceDetails()" time="0.0014269351959228516">
        </testcase>
        <testcase classname="PushActivationStateMachineTests" name="test__010__Activation_state_machine__State_NotActivated__on_Event_CalledActivate__none_of_them_then_should_transition_to_WaitingForPushDeviceDetails()" time="0.0011010169982910156">
        </testcase>
        <testcase classname="PushActivationStateMachineTests" name="test__011__Activation_state_machine__State_NotActivated__on_Event_CalledActivate__the_local_device_has_id_and_deviceIdentityToken__emits_a_SyncRegistrationFailed_event_with_code_61002_if_client_IDs_don_t_match()" time="0.002340078353881836">
        </testcase>
        <testcase classname="PushActivationStateMachineTests" name="test__012__Activation_state_machine__State_NotActivated__on_Event_CalledActivate__the_local_device_has_id_and_deviceIdentityToken__the_local_DeviceDetails_matches_the_instance_s_client_ID__calls_registerCallback__transitions_to_WaitingForRegistrationSync()" time="0.004533052444458008">
        </testcase>
        <testcase classname="PushActivationStateMachineTests" name="test__013__Activation_state_machine__State_NotActivated__on_Event_CalledActivate__the_local_device_has_id_and_deviceIdentityToken__the_local_DeviceDetails_matches_the_instance_s_client_ID__PUTs_device_registration__transitions_to_WaitingForRegistrationSync()" time="0.0022219419479370117">
        </testcase>
        <testcase classname="PushActivationStateMachineTests" name="test__014__Activation_state_machine__State_NotActivated__on_Event_CalledActivate__local_device__should_have_a_generated_id()" time="0.0014879703521728516">
        </testcase>
        <testcase classname="PushActivationStateMachineTests" name="test__015__Activation_state_machine__State_NotActivated__on_Event_CalledActivate__local_device__should_have_a_generated_secret()" time="0.0011750459671020508">
        </testcase>
        <testcase classname="PushActivationStateMachineTests" name="test__016__Activation_state_machine__State_NotActivated__on_Event_CalledActivate__local_device__should_have_a_clientID_if_the_client_is_identified()" time="0.0013290643692016602">
        </testcase>
        <testcase classname="PushActivationStateMachineTests" name="test__017__Activation_state_machine__State_WaitingForPushDeviceDetails__on_Event_CalledActivate()" time="0.0009990930557250977">
        </testcase>
        <testcase classname="PushActivationStateMachineTests" name="test__018__Activation_state_machine__State_WaitingForPushDeviceDetails__on_Event_CalledDeactivate()" time="0.0014189481735229492">
        </testcase>
        <testcase classname="PushActivationStateMachineTests" name="test__019__Activation_state_machine__State_WaitingForPushDeviceDetails__on_Event_GettingPushDeviceDetailsFailed()" time="0.0014009475708007812">
        </testcase>
        <testcase classname="PushActivationStateMachineTests" name="test__020__Activation_state_machine__State_WaitingForPushDeviceDetails__when_initializing_from_persistent_state_with_a_deviceToken__GotPushDeviceDetails_should_be_re_emitted()" time="0.0037189722061157227">
        </testcase>
        <testcase classname="PushActivationStateMachineTests" name="test__022__Activation_state_machine__State_WaitingForPushDeviceDetails__on_Event_GotPushDeviceDetails__should_use_custom_registerCallback_and_fire_GotDeviceRegistration_event()" time="0.004633903503417969">
        </testcase>
        <testcase classname="PushActivationStateMachineTests" name="test__023__Activation_state_machine__State_WaitingForPushDeviceDetails__on_Event_GotPushDeviceDetails__should_use_custom_registerCallback_and_fire_GettingDeviceRegistrationFailed_event()" time="0.0015499591827392578">
        </testcase>
        <testcase classname="PushActivationStateMachineTests" name="test__024__Activation_state_machine__State_WaitingForPushDeviceDetails__on_Event_GotPushDeviceDetails__should_fire_GotDeviceRegistration_event()" time="0.005761981010437012">
        </testcase>
        <testcase classname="PushActivationStateMachineTests" name="test__025__Activation_state_machine__State_WaitingForPushDeviceDetails__on_Event_GotPushDeviceDetails__should_fire_GettingDeviceRegistrationFailed_event()" time="0.0016560554504394531">
        </testcase>
        <testcase classname="PushActivationStateMachineTests" name="test__026__Activation_state_machine__State_WaitingForPushDeviceDetails__on_Event_GotPushDeviceDetails__should_transition_to_WaitingForDeviceRegistration()" time="0.0012509822845458984">
        </testcase>
        <testcase classname="PushActivationStateMachineTests" name="test__027__Activation_state_machine__State_WaitingForDeviceRegistration__on_Event_CalledActivate()" time="0.0011620521545410156">
        </testcase>
        <testcase classname="PushActivationStateMachineTests" name="test__028__Activation_state_machine__State_WaitingForDeviceRegistration__on_Event_GotDeviceRegistration()" time="0.002001047134399414">
        </testcase>
        <testcase classname="PushActivationStateMachineTests" name="test__029__Activation_state_machine__State_WaitingForDeviceRegistration__on_Event_GettingDeviceRegistrationFailed()" time="0.0012689828872680664">
        </testcase>
        <testcase classname="PushActivationStateMachineTests" name="test__030__Activation_state_machine__State_WaitingForNewPushDeviceDetails__on_Event_CalledActivate()" time="0.0019539594650268555">
        </testcase>
        <testcase classname="PushActivationStateMachineTests" name="test__031__Activation_state_machine__State_WaitingForNewPushDeviceDetails__on_Event_CalledDeactivate__should_use_custom_deregisterCallback_and_fire_Deregistered_event()" time="0.0037480592727661133">
        </testcase>
        <testcase classname="PushActivationStateMachineTests" name="test__032__Activation_state_machine__State_WaitingForNewPushDeviceDetails__on_Event_CalledDeactivate__should_use_custom_deregisterCallback_and_fire_DeregistrationFailed_event()" time="0.001356959342956543">
        </testcase>
        <testcase classname="PushActivationStateMachineTests" name="test__033__Activation_state_machine__State_WaitingForNewPushDeviceDetails__on_Event_CalledDeactivate__should_fire_Deregistered_event_and_include_DeviceSecret_HTTP_header()" time="0.005267977714538574">
        </testcase>
        <testcase classname="PushActivationStateMachineTests" name="test__034__Activation_state_machine__State_WaitingForNewPushDeviceDetails__on_Event_CalledDeactivate__should_fire_Deregistered_event_and_include_DeviceIdentityToken_HTTP_header()" time="0.0026900768280029297">
        </testcase>
        <testcase classname="PushActivationStateMachineTests" name="test__035__Activation_state_machine__State_WaitingForNewPushDeviceDetails__on_Event_CalledDeactivate__should_fire_DeregistrationFailed_event()" time="0.00288999080657959">
        </testcase>
        <testcase classname="PushActivationStateMachineTests" name="test__036__Activation_state_machine__State_WaitingForRegistrationSync_through_ARTPushActivationEventCalledActivate__on_Event_CalledActivate()" time="0.001061081886291504">
        </testcase>
        <testcase classname="PushActivationStateMachineTests" name="test__037__Activation_state_machine__State_WaitingForRegistrationSync_through_ARTPushActivationEventCalledActivate__on_Event_RegistrationSynced()" time="0.001515030860900879">
        </testcase>
        <testcase classname="PushActivationStateMachineTests" name="test__038__Activation_state_machine__State_WaitingForRegistrationSync_through_ARTPushActivationEventCalledActivate__on_Event_SyncRegistrationFailed()" time="0.001338958740234375">
        </testcase>
        <testcase classname="PushActivationStateMachineTests" name="test__039__Activation_state_machine__State_WaitingForRegistrationSync_through_ARTPushActivationEventGotPushDeviceDetails__on_Event_CalledActivate()" time="0.0010720491409301758">
        </testcase>
        <testcase classname="PushActivationStateMachineTests" name="test__040__Activation_state_machine__State_WaitingForRegistrationSync_through_ARTPushActivationEventGotPushDeviceDetails__on_Event_RegistrationSynced()" time="0.0011680126190185547">
        </testcase>
        <testcase classname="PushActivationStateMachineTests" name="test__041__Activation_state_machine__State_WaitingForRegistrationSync_through_ARTPushActivationEventGotPushDeviceDetails__on_Event_SyncRegistrationFailed()" time="0.0017620325088500977">
        </testcase>
        <testcase classname="PushActivationStateMachineTests" name="test__042__Activation_state_machine__State_AfterRegistrationSyncFailed__on_Event_CalledActivate__the_local_device_has_id_and_deviceIdentityToken__emits_a_SyncRegistrationFailed_event_with_code_61002_if_client_IDs_don_t_match()" time="0.00592803955078125">
        </testcase>
        <testcase classname="PushActivationStateMachineTests" name="test__043__Activation_state_machine__State_AfterRegistrationSyncFailed__on_Event_CalledActivate__the_local_device_has_id_and_deviceIdentityToken__the_local_DeviceDetails_matches_the_instance_s_client_ID__calls_registerCallback__transitions_to_WaitingForRegistrationSync()" time="0.0012649297714233398">
        </testcase>
        <testcase classname="PushActivationStateMachineTests" name="test__044__Activation_state_machine__State_AfterRegistrationSyncFailed__on_Event_CalledActivate__the_local_device_has_id_and_deviceIdentityToken__the_local_DeviceDetails_matches_the_instance_s_client_ID__PUTs_device_registration__transitions_to_WaitingForRegistrationSync()" time="0.0019570589065551758">
        </testcase>
        <testcase classname="PushActivationStateMachineTests" name="test__045__Activation_state_machine__State_AfterRegistrationSyncFailed__on_Event_GotPushDeviceDetails__the_local_device_has_id_and_deviceIdentityToken__emits_a_SyncRegistrationFailed_event_with_code_61002_if_client_IDs_don_t_match()" time="0.001811981201171875">
        </testcase>
        <testcase classname="PushActivationStateMachineTests" name="test__046__Activation_state_machine__State_AfterRegistrationSyncFailed__on_Event_GotPushDeviceDetails__the_local_device_has_id_and_deviceIdentityToken__the_local_DeviceDetails_matches_the_instance_s_client_ID__calls_registerCallback__transitions_to_WaitingForRegistrationSync()" time="0.001237034797668457">
        </testcase>
        <testcase classname="PushActivationStateMachineTests" name="test__047__Activation_state_machine__State_AfterRegistrationSyncFailed__on_Event_GotPushDeviceDetails__the_local_device_has_id_and_deviceIdentityToken__the_local_DeviceDetails_matches_the_instance_s_client_ID__PUTs_device_registration__transitions_to_WaitingForRegistrationSync()" time="0.0013490915298461914">
        </testcase>
        <testcase classname="PushActivationStateMachineTests" name="test__048__Activation_state_machine__State_AfterRegistrationSyncFailed__on_Event_CalledDeactivate__should_use_custom_deregisterCallback_and_fire_Deregistered_event()" time="0.0011960268020629883">
        </testcase>
        <testcase classname="PushActivationStateMachineTests" name="test__049__Activation_state_machine__State_AfterRegistrationSyncFailed__on_Event_CalledDeactivate__should_use_custom_deregisterCallback_and_fire_DeregistrationFailed_event()" time="0.018337011337280273">
        </testcase>
        <testcase classname="PushActivationStateMachineTests" name="test__050__Activation_state_machine__State_AfterRegistrationSyncFailed__on_Event_CalledDeactivate__should_fire_Deregistered_event_and_include_DeviceSecret_HTTP_header()" time="0.0014399290084838867">
        </testcase>
        <testcase classname="PushActivationStateMachineTests" name="test__051__Activation_state_machine__State_AfterRegistrationSyncFailed__on_Event_CalledDeactivate__should_fire_Deregistered_event_and_include_DeviceIdentityToken_HTTP_header()" time="0.0020428895950317383">
        </testcase>
        <testcase classname="PushActivationStateMachineTests" name="test__052__Activation_state_machine__State_AfterRegistrationSyncFailed__on_Event_CalledDeactivate__should_fire_DeregistrationFailed_event()" time="0.0013080835342407227">
        </testcase>
        <testcase classname="PushActivationStateMachineTests" name="test__053__Activation_state_machine__State_WaitingForDeregistration__on_Event_CalledDeactivate()" time="0.0024079084396362305">
        </testcase>
        <testcase classname="PushActivationStateMachineTests" name="test__054__Activation_state_machine__State_WaitingForDeregistration__on_Event_Deregistered()" time="0.0014740228652954102">
        </testcase>
        <testcase classname="PushActivationStateMachineTests" name="test__055__Activation_state_machine__State_WaitingForDeregistration__on_Event_DeregistrationFailed()" time="0.0010409355163574219">
        </testcase>
        <testcase classname="PushActivationStateMachineTests" name="test__056__Activation_state_machine__should_be_possible_to_activate_and_deactivate_and_then_activate_again_with_different_clientId()" time="0.004545092582702637">
        </testcase>
        <testcase classname="PushActivationStateMachineTests" name="test__100__Activation_state_machine__State_WaitingForNewPushDeviceDetails__on_Event_GotPushDeviceDetails__with_push_to_start_token__PATCHes_recipient()" time="0.0010460615158081055">
        </testcase>
        <testcase classname="PushAdminTests" name="test__001__publish__should_perform_an_HTTP_request_to__push_publish()" time="0.0014560222625732422">
        </testcase>
        <testcase classname="PushAdminTests" name="test__002__publish__should_publish_successfully()" time="0.48358702659606934">
        </testcase>
        <testcase classname="PushAdminTests" name="test__003__publish__should_fail_with_a_bad_recipient()" time="0.4725949764251709">
        </testcase>
        <testcase classname="PushAdminTests" name="test__004__publish__should_fail_with_an_empty_recipient()" time="0.3145730495452881">
        </testcase>
        <testcase classname="PushAdminTests" name="test__005__publish__should_fail_with_an_empty_payload()" time="0.33079004287719727">
        </testcase>
        <testcase classname="PushAdminTests" name="test__006__Device_Registrations__get__should_return_a_device()" time="0.15557003021240234">
        </testcase>
        <testcase classname="PushAdminTests" name="test__007__Device_Registrations__get__should_not_return_a_device_if_it_doesnt_exist()" time="0.15821504592895508">
        </testcase>
        <testcase classname="PushAdminTests" name="test__008__Device_Registrations__get__push_device_authentication__should_include_DeviceIdentityToken_HTTP_header()" time="0.003018021583557129">
        </testcase>
        <testcase classname="PushAdminTests" name="test__009__Device_Registrations__get__push_device_authentication__should_include_DeviceSecret_HTTP_header()" time="0.0021289587020874023">
        </testcase>
        <testcase classname="PushAdminTests" name="test__010__Device_Registrations__list__should_list_devices_by_id()" time="0.1665029525756836">
        </testcase>
        <testcase classname="PushAdminTests" name="test__011__Device_Registrations__list__should_list_devices_by_client_id()" time="0.15355098247528076">
        </testcase>
        <testcase classname="PushAdminTests" name="test__012__Device_Registrations__list__should_list_devices_sorted()" time="0.15616798400878906">
        </testcase>
        <testcase classname="PushAdminTests" name="test__013__Device_Registrations__list__should_return_an_empty_list_when_id_does_not_exist()" time="0.16063404083251953">
        </testcase>
        <testcase classname="PushAdminTests" name="test__014__Device_Registrations__remove__should_unregister_a_device()" time="0.001999974250793457">
        </testcase>
        <testcase classname="PushAdminTests" name="test__015__Device_Registrations__save__should_register_a_device()" time="0.002068042755126953">
        </testcase>
        <testcase classname="PushAdminTests" name="test__016__Device_Registrations__save__push_device_authentication__should_include_DeviceIdentityToken_HTTP_header()" time="0.00462496280670166">
        </testcase>
        <testcase classname="PushAdminTests" name="test__017__Device_Registrations__save__push_device_authentication__should_include_DeviceSecret_HTTP_header()" time="0.002187013626098633">
        </testcase>
        <testcase classname="PushAdminTests" name="test__018__Device_Registrations__removeWhere__should_unregister_a_device()" time="0.15585196018218994">
        </testcase>
        <testcase classname="PushAdminTests" name="test__019__Channel_Subscriptions__save__should_add_a_subscription()" time="0.3100719451904297">
        </testcase>
        <testcase classname="PushAdminTests" name="test__020__Channel_Subscriptions__save__should_update_a_subscription()" time="0.33857107162475586">
        </testcase>
        <testcase classname="PushAdminTests" name="test__021__Channel_Subscriptions__save__should_fail_with_a_bad_recipient()" time="0.16703307628631592">
        </testcase>
        <testcase classname="PushAdminTests" name="test__022__Channel_Subscriptions__save__push_device_authentication__should_include_DeviceIdentityToken_HTTP_header()" time="0.0020890235900878906">
        </testcase>
        <testcase classname="PushAdminTests" name="test__023__Channel_Subscriptions__save__push_device_authentication__should_include_DeviceSecret_HTTP_header()" time="0.003487110137939453">
        </testcase>
        <testcase classname="PushAdminTests" name="test__024__Channel_Subscriptions__list__should_receive_a_list_of_subscriptions()" time="0.23518800735473633">
        </testcase>
        <testcase classname="PushAdminTests" name="test__025__Channel_Subscriptions__listChannels__should_receive_a_list_of_subscriptions()" time="0.15482699871063232">
        </testcase>
        <testcase classname="PushAdminTests" name="test__026__Channel_Subscriptions__remove__should_remove_a_subscription()" time="0.3663640022277832">
        </testcase>
        <testcase classname="PushAdminTests" name="test__027__Channel_Subscriptions__remove__push_device_authentication__should_include_DeviceIdentityToken_HTTP_header()" time="0.0049430131912231445">
        </testcase>
        <testcase classname="PushAdminTests" name="test__028__Channel_Subscriptions__remove__push_device_authentication__should_include_DeviceSecret_HTTP_header()" time="0.0061740875244140625">
        </testcase>
        <testcase classname="PushAdminTests" name="test__029__Channel_Subscriptions__removeWhere__should_remove_by_cliendId()" time="1.113908052444458">
        </testcase>
        <testcase classname="PushAdminTests" name="test__030__Channel_Subscriptions__removeWhere__should_remove_by_cliendId_and_channel()" time="0.4853060245513916">
        </testcase>
        <testcase classname="PushAdminTests" name="test__031__Channel_Subscriptions__removeWhere__should_remove_by_deviceId()" time="0.671981930732727">
        </testcase>
        <testcase classname="PushAdminTests" name="test__032__Channel_Subscriptions__removeWhere__should_not_remove_by_inexistent_deviceId()" time="0.40197598934173584">
        </testcase>
        <testcase classname="PushAdminTests" name="test__033__local_device__should_include_an_id_and_a_secret()" time="0.0009660720825195312">
        </testcase>
        <testcase classname="PushChannelTests" name="test__001__Push_Channel__subscribeDevice__should_fail_if_the_LocalDevice_doesn_t_have_an_deviceIdentityToken()" time="0.010158061981201172">
        </testcase>
        <testcase classname="PushChannelTests" name="test__002__Push_Channel__subscribeDevice__should_do_a_POST_request_to__push_channelSubscriptions_and_include_device_authentication()" time="0.0031499862670898438">
        </testcase>
        <testcase classname="PushChannelTests" name="test__003__Push_Channel__subscribeClient__should_fail_if_the_LocalDevice_doesn_t_have_a_clientId()" time="0.0024379491806030273">
        </testcase>
        <testcase classname="PushChannelTests" name="test__004__Push_Channel__subscribeClient__should_do_a_POST_request_to__push_channelSubscriptions()" time="0.0021250247955322266">
        </testcase>
        <testcase classname="PushChannelTests" name="test__005__Push_Channel__unsubscribeDevice__should_fail_if_the_LocalDevice_doesn_t_have_a_deviceIdentityToken()" time="0.0071430206298828125">
        </testcase>
        <testcase classname="PushChannelTests" name="test__006__Push_Channel__unsubscribeDevice__should_do_a_DELETE_request_to__push_channelSubscriptions_and_include_device_authentication()" time="0.002308964729309082">
        </testcase>
        <testcase classname="PushChannelTests" name="test__007__Push_Channel__unsubscribeClient__should_fail_if_the_LocalDevice_doesn_t_have_a_clientId()" time="0.0027039051055908203">
        </testcase>
        <testcase classname="PushChannelTests" name="test__008__Push_Channel__unsubscribeClient__should_do_a_DELETE_request_to__push_channelSubscriptions()" time="0.0062830448150634766">
        </testcase>
        <testcase classname="PushChannelTests" name="test__009__Push_Channel__listSubscriptions__should_return_a_paginated_result_with_PushChannelSubscription_filtered_by_channel_and_device()" time="0.0012799501419067383">
        </testcase>
        <testcase classname="PushChannelTests" name="test__010__Push_Channel__listSubscriptions__should_return_a_paginated_result_with_PushChannelSubscription_filtered_by_channel_and_client()" time="0.0027109384536743164">
        </testcase>
        <testcase classname="PushChannelTests" name="test__011__Push_Channel__listSubscriptions__should_not_accept_null_deviceId_and_null_clientId()" time="0.0025730133056640625">
        </testcase>
        <testcase classname="PushChannelTests" name="test__012__Push_Channel__listSubscriptions__should_not_accept_both_deviceId_and_clientId_params_at_the_same_time()" time="0.001295924186706543">
        </testcase>
        <testcase classname="PushChannelTests" name="test__013__Push_Channel__listSubscriptions__should_return_a_paginated_result_with_PushChannelSubscription()" time="0.42094099521636963">
        </testcase>
        <testcase classname="PushTests" name="test__001__activation__activate_method_should_send_a_CalledActivate_event_to_the_state_machine()" time="0.0021070241928100586">
        </testcase>
        <testcase classname="PushTests" name="test__002__activation__deactivate_method_should_send_a_CalledDeactivate_event_to_the_state_machine()" time="0.0011130571365356445">
        </testcase>
        <testcase classname="PushTests" name="test__003__activation__should_handle_GotPushDeviceDetails_event_when_platform_s_APIs_sends_the_details_for_push_notifications()" time="0.0016880035400390625">
        </testcase>
        <testcase classname="PushTests" name="test__004__activation__sends_GettingPushDeviceDetailsFailed_when_push_registration_fails()" time="0.0012650489807128906">
        </testcase>
        <testcase classname="PushTests" name="test__005__activation__should_update_LocalDevice_clientId_when_it_s_null_with_auth_clientId()" time="0.15066099166870117">
        </testcase>
        <testcase classname="PushTests" name="test__006__activation__should_store_the_device_token_data_as_string()" time="0.0015399456024169922">
        </testcase>
        <testcase classname="PushTests" name="test__007__activation__should_not_sync_the_local_device_dispatched_in_internal_queue()" time="0.0007790327072143555">
        </testcase>
        <testcase classname="PushTests" name="test__008__LocalDevice__has_a_device_method_that_returns_a_LocalDevice()" time="0.0021589994430541992">
        </testcase>
        <testcase classname="PushTests" name="test__009__LocalDevice__the_device_is_lazily_populated_from_the_persisted_state()" time="0.0012689828872680664">
        </testcase>
        <testcase classname="PushTests" name="test__010__LocalDevice__authentication_on_registered_device_sends_a_GotPushDeviceDetails_with_new_clientID()" time="3.117123007774353">
        </testcase>
        <testcase classname="PushTests" name="test__011__LocalDevice__sets_device_s_client_ID_from_registration_response()" time="0.0020470619201660156">
        </testcase>
        <testcase classname="PushTests" name="test__012__LocalDevice__when_using_token_authentication__new_clientID_is_set()" time="0.37225091457366943">
        </testcase>
        <testcase classname="PushTests" name="test__013__LocalDevice__when_getting_a_client_ID_from_CONNECTED_message__new_clientID_is_set()" time="0.006630063056945801">
        </testcase>
        <testcase classname="PushTests" name="test__014__Registerer_Delegate_option__a_successful_activation_should_call_the_correct_registerer_delegate_method()" time="0.16866302490234375">
        </testcase>
        <testcase classname="PushTests" name="test__015__Registerer_Delegate_option__registerer_delegate_should_not_hold_a_strong_instance_reference()" time="0.0026040077209472656">
        </testcase>
        <testcase classname="PushTests" name="test__016__activate_should_call_registerForAPNS_while_transition_from_not_activated()" time="0.001255035400390625">
        </testcase>
        <testcase classname="PushTests" name="test__017__LocalDevice__must_verify_the_validity_of_saved_push_details_and_update_if_needed_on_the_Ably_server_by_triggering_GotPushDeviceDetails()" time="0.002077937126159668">
        </testcase>
        <testcase classname="PushTests" name="test__018__LocalDevice__when_alternative_device_token_available_update_push_details_on_the_Ably_server_by_triggering_GotPushDeviceDetails()" time="0.002313971519470215">
        </testcase>
        <testcase classname="PushTests" name="test__100__push_to_start__registerPushToStartToken_stores_token_and_sends_GotPushDeviceDetails()" time="0.0013339519500732422">
        </testcase>
        <testcase classname="RealtimeAnnotationsTests" name="test__annotation_data_uses_a_cipher_added_by_setOptions_after_channel_creation()" time="0.8045790195465088">
        </testcase>
        <testcase classname="RealtimeAnnotationsTests" name="test__annotations_subscribe_should_implicitly_attach_the_channel_if_options_attachOnSubscribe_is_true()" time="1.4597759246826172">
            <failure message="XCTAssertNil failed: &quot;Error 80017 - connection broken before receiving publishing acknowledgment&quot; (/Users/runner/work/ably-cocoa/ably-cocoa/Test/AblyTests/Tests/RealtimeAnnotationsTests.swift#EndingLineNumber=433&amp;StartingLineNumber=433)">
            </failure>
        </testcase>
        <testcase classname="RealtimeAnnotationsTests" name="test__annotations_subscribe_should_implicitly_attach_the_channel_if_options_attachOnSubscribe_is_true()" time="0.6139318943023682">
        </testcase>
        <testcase classname="RealtimeAnnotationsTests" name="test__annotations_subscribe_should_not_implicitly_attach_the_channel_if_options_attachOnSubscribe_is_false()" time="1.060552954673767">
        </testcase>
        <testcase classname="RealtimeAnnotationsTests" name="test__annotations_subscribe_should_not_result_in_an_error_if_channel_is_in_the_FAILED_state_and_options_attachOnSubscribe_is_false()" time="1.0167629718780518">
        </testcase>
        <testcase classname="RealtimeAnnotationsTests" name="test__annotations_subscribe_should_result_in_an_error_if_channel_is_in_the_FAILED_state_and_options_attachOnSubscribe_is_true()" time="0.00937795639038086">
        </testcase>
        <testcase classname="RealtimeAnnotationsTests" name="test__if_annotation_subscribe_mode_is_missing_from_channel_options_then_subscription_will_not_work()" time="1.6215980052947998">
        </testcase>
        <testcase classname="RealtimeAnnotationsTests" name="test__publish_annotation_exceeding_max_message_size()" time="0.32003307342529297">
        </testcase>
        <testcase classname="RealtimeAnnotationsTests" name="test__publish_delete_and_get_annotations()" time="3.562054991722107">
        </testcase>
        <testcase classname="RealtimeClientChannelTests" name="test__001__Channel__should_process_all_incoming_messages_and_presence_messages_as_soon_as_a_Channel_becomes_attached()" time="0.9887739419937134">
        </testcase>
        <testcase classname="RealtimeClientChannelTests" name="test__002__Channel__should_not_crash_when_an_ATTACH_request_is_responded_with_a_DETACHED()" time="0.3278040885925293">
        </testcase>
        <testcase classname="RealtimeClientChannelTests" name="test__003__Channel__EventEmitter__channel_states_and_events__should_implement_the_EventEmitter_and_emit_events_for_state_changes()" time="0.385079026222229">
        </testcase>
        <testcase classname="RealtimeClientChannelTests" name="test__004__Channel__EventEmitter__channel_states_and_events__should_implement_the_EventEmitter_and_emit_events_for_FAILED_state_changes()" time="0.5026869773864746">
        </testcase>
        <testcase classname="RealtimeClientChannelTests" name="test__005__Channel__EventEmitter__channel_states_and_events__should_implement_the_EventEmitter_and_emit_events_for_SUSPENDED_state_changes()" time="0.3264979124069214">
        </testcase>
        <testcase classname="RealtimeClientChannelTests" name="test__006__Channel__EventEmitter__channel_states_and_events__can_emit_an_UPDATE_event()" time="0.34122002124786377">
        </testcase>
        <testcase classname="RealtimeClientChannelTests" name="test__007__Channel__EventEmitter__channel_states_and_events__should_not_emit_detached_event_on_an_already_detached_channel()" time="0.48433399200439453">
        </testcase>
        <testcase classname="RealtimeClientChannelTests" name="test__008__Channel__EventEmitter__channel_states_and_events__state_attribute_should_be_the_current_state_of_the_channel()" time="0.3248199224472046">
        </testcase>
        <testcase classname="RealtimeClientChannelTests" name="test__009__Channel__EventEmitter__channel_states_and_events__should_contain_an_ErrorInfo_object_with_details_when_an_error_occurs()" time="0.00489199161529541">
        </testcase>
        <testcase classname="RealtimeClientChannelTests" name="test__010__Channel__EventEmitter__channel_states_and_events__a_ChannelStateChange_is_emitted_as_the_first_argument_for_every_channel_state_change()" time="0.39726197719573975">
        </testcase>
        <testcase classname="RealtimeClientChannelTests" name="test__011a__Channel__EventEmitter__channel_states_and_events__ChannelStateChange_will_contain_a_resumed_boolean_attribute_with_value__true__if_the_bit_flag_RESUMED_was_included()" time="5.112857937812805">
        </testcase>
        <testcase classname="RealtimeClientChannelTests" name="test__011b__Channel__EventEmitter__channel_states_and_events__ChannelStateChange_will_contain_a_resumed_boolean_attribute_with_value__true__if_the_bit_flag_RESUMED_was_included_for_recovered_connection()" time="0.6527819633483887">
        </testcase>
        <testcase classname="RealtimeClientChannelTests" name="test__013__Channel__connection_state__if_the_connection_state_enters_the_CONNECTED_state__then_a_SUSPENDED_channel_will_transition_to_ATTACHING_and_goes_back_to_SUSPNDED_on_timeout()" time="3.893647074699402">
        </testcase>
        <testcase classname="RealtimeClientChannelTests" name="test__015__Channel__connection_state__should_attach_successfully_and_remain_attached_after_the_connection_goes_from_SUSPENDED_to_CONNECTED()" time="8.104977011680603">
        </testcase>
        <testcase classname="RealtimeClientChannelTests" name="test__016__Channel__connection_state__if_the_connection_state_enters_the_DISCONNECTED_state__it_will_have_no_effect_on_the_channel_states()" time="4.631072998046875">
        </testcase>
        <testcase classname="RealtimeClientChannelTests" name="test__017__Channel__connection_state__changes_to_FAILED__ATTACHING_channel_should_transition_to_FAILED()" time="0.0035250186920166016">
        </testcase>
        <testcase classname="RealtimeClientChannelTests" name="test__018__Channel__connection_state__changes_to_FAILED__ATTACHED_channel_should_transition_to_FAILED()" time="0.32606589794158936">
        </testcase>
        <testcase classname="RealtimeClientChannelTests" name="test__019__Channel__connection_state__changes_to_FAILED__channel_being_released_waiting_for_DETACH_shouldn_t_crash__issue__918_()" time="0.014501094818115234">
        </testcase>
        <testcase classname="RealtimeClientChannelTests" name="test__020__Channel__connection_state__changes_to_FAILED__should_immediately_fail_if_not_in_the_connected_state()" time="0.001757979393005371">
        </testcase>
        <testcase classname="RealtimeClientChannelTests" name="test__021__Channel__connection_state__changes_to_FAILED__should_keep_the_channels_attached_when_client_reconnected_successfully_and_queue_messages_is_disabled()" time="0.7323030233383179">
        </testcase>
        <testcase classname="RealtimeClientChannelTests" name="test__022__Channel__connection_state__changes_to_CLOSED__ATTACHING_channel_should_transition_to_DETACHED()" time="0.35528790950775146">
        </testcase>
        <testcase classname="RealtimeClientChannelTests" name="test__023__Channel__connection_state__changes_to_CLOSED__ATTACHED_channel_should_transition_to_DETACHED()" time="0.3964099884033203">
        </testcase>
        <testcase classname="RealtimeClientChannelTests" name="test__024__Channel__connection_state__changes_to_SUSPENDED__ATTACHING_channel_should_transition_to_SUSPENDED()" time="0.2648979425430298">
        </testcase>
        <testcase classname="RealtimeClientChannelTests" name="test__025__Channel__connection_state__changes_to_SUSPENDED__ATTACHED_channel_should_transition_to_SUSPENDED()" time="0.31324100494384766">
        </testcase>
        <testcase classname="RealtimeClientChannelTests" name="test__026__Channel__connection_state__changes_to_SUSPENDED__channel_being_released_waiting_for_DETACH_shouldn_t_crash__issue__918_()" time="0.02463698387145996">
        </testcase>
        <testcase classname="RealtimeClientChannelTests" name="test__027__Channel__attach__if_already_ATTACHED_or_ATTACHING_nothing_is_done()" time="0.3276689052581787">
        </testcase>
        <testcase classname="RealtimeClientChannelTests" name="test__028__Channel__attach__if_the_user_does_not_have_sufficient_permissions_to_attach__then_the_channel_will_transition_to_FAILED_and_set_the_errorReason()" time="0.85978102684021">
        </testcase>
        <testcase classname="RealtimeClientChannelTests" name="test__029__Channel__attach__if_the_channel_is_in_the_FAILED_state__the_attach_request_sets_its_errorReason_to_null__and_proceeds_with_a_channel_attach()" time="0.4074009656906128">
        </testcase>
        <testcase classname="RealtimeClientChannelTests" name="test__030__Channel__attach__should_send_an_ATTACH_ProtocolMessage__change_state_to_ATTACHING_and_change_state_to_ATTACHED_after_confirmation()" time="0.3267960548400879">
        </testcase>
        <testcase classname="RealtimeClientChannelTests" name="test__031__Channel__attach__should_transition_the_channel_state_to_FAILED_if_the_user_does_not_have_sufficient_permissions()" time="0.47085702419281006">
        </testcase>
        <testcase classname="RealtimeClientChannelTests" name="test__032__Channel__attach__should_transition_the_channel_state_to_SUSPENDED_if_ATTACHED_ProtocolMessage_is_not_received()" time="2.3347290754318237">
        </testcase>
        <testcase classname="RealtimeClientChannelTests" name="test__033__Channel__attach__if_called_with_a_callback_should_call_it_once_attached()" time="0.3268320560455322">
        </testcase>
        <testcase classname="RealtimeClientChannelTests" name="test__034__Channel__attach__if_called_with_a_callback_and_already_attaching_should_call_the_callback_once_attached()" time="0.3244800567626953">
        </testcase>
        <testcase classname="RealtimeClientChannelTests" name="test__035__Channel__attach__if_called_with_a_callback_and_already_attached_should_call_the_callback_with_nil_error()" time="0.3267860412597656">
        </testcase>
        <testcase classname="RealtimeClientChannelTests" name="test__036__Channel__attach__if_the_channel_is_in_a_pending_state_ATTACHING__do_the_attach_operation_after_the_completion_of_the_pending_request()" time="0.37599503993988037">
        </testcase>
        <testcase classname="RealtimeClientChannelTests" name="test__037__Channel__attach__if_the_channel_is_in_a_pending_state_DETACHING__do_the_attach_operation_after_the_completion_of_the_pending_request()" time="0.4501469135284424">
        </testcase>
        <testcase classname="RealtimeClientChannelTests" name="test__038__Channel__attach__a_channel_in_DETACHING_can_actually_move_back_to_ATTACHED_if_it_fails_to_detach()" time="1.3243069648742676">
        </testcase>
        <testcase classname="RealtimeClientChannelTests" name="test__039__Channel__attach__results_in_an_error_if_the_connection_state_is__CLOSING()" time="0.2540799379348755">
        </testcase>
        <testcase classname="RealtimeClientChannelTests" name="test__040__Channel__attach__results_in_an_error_if_the_connection_state_is__CLOSED()" time="0.31392908096313477">
        </testcase>
        <testcase classname="RealtimeClientChannelTests" name="test__041__Channel__attach__results_in_an_error_if_the_connection_state_is__SUSPENDED()" time="0.0027729272842407227">
        </testcase>
        <testcase classname="RealtimeClientChannelTests" name="test__042__Channel__attach__results_in_an_error_if_the_connection_state_is__FAILED()" time="0.0036829710006713867">
        </testcase>
        <testcase classname="RealtimeClientChannelTests" name="test__043__Channel__attach__happens_when_connection_is_CONNECTED_if_it_s_currently__INITIALIZED()" time="0.3221139907836914">
        </testcase>
        <testcase classname="RealtimeClientChannelTests" name="test__044__Channel__attach__happens_when_connection_is_CONNECTED_if_it_s_currently__CONNECTING()" time="0.32017600536346436">
        </testcase>
        <testcase classname="RealtimeClientChannelTests" name="test__045__Channel__attach__happens_when_connection_is_CONNECTED_if_it_s_currently__DISCONNECTED()" time="0.6948150396347046">
        </testcase>
        <testcase classname="RealtimeClientChannelTests" name="test__046__Channel__attach__attach_resume__should_pass_attach_resume_flag_in_attach_message()" time="0.3887079954147339">
        </testcase>
        <testcase classname="RealtimeClientChannelTests" name="test__047__Channel__attach__attach_resume__should_have_correct_AttachResume_value()" time="0.3216599225997925">
        </testcase>
        <testcase classname="RealtimeClientChannelTests" name="test__048__Channel__attach__attach_resume__should_encode_correctly_the_AttachResume_flag()" time="2.7890340089797974">
        </testcase>
        <testcase classname="RealtimeClientChannelTests" name="test__049__Channel__detach__if_state_is_INITIALIZED_or_DETACHED_nothing_is_done()" time="0.3957160711288452">
        </testcase>
        <testcase classname="RealtimeClientChannelTests" name="test__050__Channel__detach__if_the_channel_is_in_a_pending_state_DETACHING__do_the_detach_operation_after_the_completion_of_the_pending_request()" time="1.4407389163970947">
        </testcase>
        <testcase classname="RealtimeClientChannelTests" name="test__051__Channel__detach__if_the_channel_is_in_a_pending_state_ATTACHING__do_the_detach_operation_after_the_completion_of_the_pending_request()" time="0.34250497817993164">
        </testcase>
        <testcase classname="RealtimeClientChannelTests" name="test__052__Channel__detach__results_in_an_error_if_the_connection_state_is_FAILED()" time="0.0016340017318725586">
        </testcase>
        <testcase classname="RealtimeClientChannelTests" name="test__053__Channel__detach__should_send_a_DETACH_ProtocolMessage__change_state_to_DETACHING_and_change_state_to_DETACHED_after_confirmation()" time="0.3949331045150757">
        </testcase>
        <testcase classname="RealtimeClientChannelTests" name="test__054__Channel__detach__if_called_with_a_callback_should_call_it_once_detached()" time="0.3876539468765259">
        </testcase>
        <testcase classname="RealtimeClientChannelTests" name="test__055__Channel__detach__if_called_with_a_callback_and_already_detaching_should_call_the_callback_once_detached()" time="0.38780808448791504">
        </testcase>
        <testcase classname="RealtimeClientChannelTests" name="test__056__Channel__detach__if_called_with_a_callback_and_already_detached_should_should_call_the_callback_with_nil_error()" time="0.39549708366394043">
        </testcase>
        <testcase classname="RealtimeClientChannelTests" name="test__057__Channel__detach__if_a_DETACHED_is_not_received_within_the_default_realtime_request_timeout__the_detach_request_should_be_treated_as_though_it_has_failed_and_the_channel_will_return_to_its_previous_state()" time="1.326646089553833">
        </testcase>
        <testcase classname="RealtimeClientChannelTests" name="test__058__Channel__detach__if_the_channel_state_is_SUSPENDED__the__detach__request_transitions_the_channel_immediately_to_the_DETACHED_state()" time="0.31928396224975586">
        </testcase>
        <testcase classname="RealtimeClientChannelTests" name="test__059__Channel__detach__results_in_an_error_if_the_connection_state_is__CLOSING()" time="0.3240790367126465">
        </testcase>
        <testcase classname="RealtimeClientChannelTests" name="test__060__Channel__detach__results_in_an_error_if_the_connection_state_is__FAILED()" time="0.3233070373535156">
        </testcase>
        <testcase classname="RealtimeClientChannelTests" name="test__061__Channel__detach__happens_when_channel_is_ATTACHED_if_connection_is_currently__INITIALIZED()" time="0.38015198707580566">
        </testcase>
        <testcase classname="RealtimeClientChannelTests" name="test__062__Channel__detach__happens_when_channel_is_ATTACHED_if_connection_is_currently__CONNECTING()" time="0.3796039819717407">
        </testcase>
        <testcase classname="RealtimeClientChannelTests" name="test__063__Channel__detach__happens_when_channel_is_ATTACHED_if_connection_is_currently__DISCONNECTED()" time="0.746770977973938">
        </testcase>
        <testcase classname="RealtimeClientChannelTests" name="test__064__Channel__publish__should_encode_messages_in_the_same_way_as_the_RestChannel()" time="0.5388540029525757">
        </testcase>
        <testcase classname="RealtimeClientChannelTests" name="test__065__Channel__publish__Message_connectionId_should_match_the_current_Connection_id_for_all_published_messages()" time="0.3440359830856323">
        </testcase>
        <testcase classname="RealtimeClientChannelTests" name="test__066__Channel__publish__should_publish_the_clientId_of_a_Message()" time="0.42353999614715576">
        </testcase>
        <testcase classname="RealtimeClientChannelTests" name="test__067__Channel__publish__should_invoke_callback__when_the_message_is_successfully_delivered()" time="0.39613401889801025">
        </testcase>
        <testcase classname="RealtimeClientChannelTests" name="test__068__Channel__publish__should_invoke_callback__upon_failure()" time="0.6367790699005127">
        </testcase>
        <testcase classname="RealtimeClientChannelTests" name="test__069__Channel__publish__should_invoke_callback__for_all_messages_published()" time="1.273987054824829">
        </testcase>
        <testcase classname="RealtimeClientChannelTests" name="test__070__Channel__publish__Connection_state_conditions__publish_should_not_trigger_an_implicit_attach()" time="0.3444570302963257">
        </testcase>
        <testcase classname="RealtimeClientChannelTests" name="test__071__Channel__publish__Connection_state_conditions__if_the_connection_is_CONNECTED_and_the_channel_is__ATTACHED_then_the_messages_should_be_published_immediately()" time="0.4068049192428589">
        </testcase>
        <testcase classname="RealtimeClientChannelTests" name="test__072__Channel__publish__Connection_state_conditions__if_the_connection_is_CONNECTED_and_the_channel_is__INITIALIZED_then_the_messages_should_be_published_immediately()" time="0.33389198780059814">
        </testcase>
        <testcase classname="RealtimeClientChannelTests" name="test__073__Channel__publish__Connection_state_conditions__if_the_connection_is_CONNECTED_and_the_channel_is__DETACHED_then_the_messages_should_be_published_immediately()" time="0.4528999328613281">
        </testcase>
        <testcase classname="RealtimeClientChannelTests" name="test__074__Channel__publish__Connection_state_conditions__if_the_connection_is_CONNECTED_and_the_channel_is__ATTACHING_then_the_messages_should_be_published_immediately()" time="0.3616229295730591">
        </testcase>
        <testcase classname="RealtimeClientChannelTests" name="test__075__Channel__publish__Connection_state_conditions__if_the_connection_is_CONNECTED_and_the_channel_is__DETACHING_then_the_messages_should_be_published_immediately()" time="0.46220993995666504">
        </testcase>
        <testcase classname="RealtimeClientChannelTests" name="test__076__Channel__publish__Connection_state_conditions__the_message__should_be_queued_and_delivered_as_soon_as_the_connection_state_returns_to_CONNECTED_if_the_connection_is__INITIALIZED()" time="0.47905898094177246">
        </testcase>
        <testcase classname="RealtimeClientChannelTests" name="test__077__Channel__publish__Connection_state_conditions__the_message__should_be_queued_and_delivered_as_soon_as_the_connection_state_returns_to_CONNECTED_if_the_connection_is__CONNECTING()" time="0.48089706897735596">
        </testcase>
        <testcase classname="RealtimeClientChannelTests" name="test__078__Channel__publish__Connection_state_conditions__the_message__should_be_queued_and_delivered_as_soon_as_the_connection_state_returns_to_CONNECTED_if_the_connection_is__DISCONNECTED()" time="0.8404109477996826">
        </testcase>
        <testcase classname="RealtimeClientChannelTests" name="test__082__Channel__publish__Connection_state_conditions__will_result_in_an_error_if_the__connection_is_SUSPENDED()" time="0.2543330192565918">
        </testcase>
        <testcase classname="RealtimeClientChannelTests" name="test__083__Channel__publish__Connection_state_conditions__will_result_in_an_error_if_the__connection_is_CLOSING()" time="0.2557640075683594">
        </testcase>
        <testcase classname="RealtimeClientChannelTests" name="test__084__Channel__publish__Connection_state_conditions__will_result_in_an_error_if_the__connection_is_CLOSED()" time="0.3362940549850464">
        </testcase>
        <testcase classname="RealtimeClientChannelTests" name="test__085__Channel__publish__Connection_state_conditions__will_result_in_an_error_if_the__connection_is_FAILED()" time="0.2535609006881714">
        </testcase>
        <testcase classname="RealtimeClientChannelTests" name="test__086__Channel__publish__Connection_state_conditions__will_result_in_an_error_if_the__channel_is_SUSPENDED()" time="0.3335540294647217">
        </testcase>
        <testcase classname="RealtimeClientChannelTests" name="test__087__Channel__publish__Connection_state_conditions__will_result_in_an_error_if_the__channel_is_FAILED()" time="0.3228060007095337">
        </testcase>
        <testcase classname="RealtimeClientChannelTests" name="test__095__Channel__publish__Unidentified_clients_using_Basic_Auth__should_have_the_provided_clientId_on_received_message_when_it_was_published_with_clientId()" time="0.3537060022354126">
        </testcase>
        <testcase classname="RealtimeClientChannelTests" name="test__096__Channel__publish__expect_either__an_array_of_Message_objects()" time="0.3567570447921753">
        </testcase>
        <testcase classname="RealtimeClientChannelTests" name="test__097__Channel__publish__expect_either__a_name_string_and_data_payload()" time="0.36289095878601074">
        </testcase>
        <testcase classname="RealtimeClientChannelTests" name="test__098__Channel__publish__expect_either__allows_name_to_be_null()" time="0.3567779064178467">
        </testcase>
        <testcase classname="RealtimeClientChannelTests" name="test__099__Channel__publish__expect_either__allows_data_to_be_null()" time="0.3553030490875244">
        </testcase>
        <testcase classname="RealtimeClientChannelTests" name="test__100__Channel__publish__expect_either__allows_name_and_data_to_be_assigned()" time="0.366131067276001">
        </testcase>
        <testcase classname="RealtimeClientChannelTests" name="test__101__Channel__publish__Identified_clients_with_clientId__when_publishing_a_Message_with_the_clientId_attribute_value_set_to_the_identified_client_s_clientId()" time="0.35018491744995117">
        </testcase>
        <testcase classname="RealtimeClientChannelTests" name="test__102__Channel__publish__Identified_clients_with_clientId__when_publishing_a_Message_with_a_different_clientId_attribute_value_from_the_identified_client_s_clientId__it_should_reject_that_publish_operation_immediately()" time="0.33044004440307617">
        </testcase>
        <testcase classname="RealtimeClientChannelTests" name="test__103__Channel__publish__Identified_clients_with_clientId__message_should_be_published_following_authentication_and_received_back_with_the_clientId_intact()" time="0.5239180326461792">
        </testcase>
        <testcase classname="RealtimeClientChannelTests" name="test__104__Channel__publish__Identified_clients_with_clientId__message_should_be_rejected_by_the_Ably_service_and_the_message_error_should_contain_the_server_error()" time="0.4911680221557617">
        </testcase>
        <testcase classname="RealtimeClientChannelTests" name="test__105__Channel__publish__Identified_clients_with_clientId__When_publishing_a_Message_with_clientId_set_to_null__should_be_unnecessary_to_set_clientId_of_the_Message_before_publishing_and_have_clientId_value_set_for_the_Message_when_received()" time="0.3562110662460327">
        </testcase>
        <testcase classname="RealtimeClientChannelTests" name="test__106__Channel__subscribe__with_no_arguments_subscribes_a_listener_to_all_messages()" time="0.35418999195098877">
        </testcase>
        <testcase classname="RealtimeClientChannelTests" name="test__107__Channel__subscribe__with_a_single_name_argument_subscribes_a_listener_to_only_messages_whose_name_member_matches_the_string_name()" time="0.3773089647293091">
        </testcase>
        <testcase classname="RealtimeClientChannelTests" name="test__108__Channel__subscribe__with_a_attach_callback_should_subscribe_and_call_the_callback_when_attached()" time="0.3880739212036133">
        </testcase>
        <testcase classname="RealtimeClientChannelTests" name="test__109__Channel__subscribe__should_implicitly_attach_the_channel_if_options_attachOnSubscribe_is_true()" time="0.6299229860305786">
        </testcase>
        <testcase classname="RealtimeClientChannelTests" name="test__109b__Channel__subscribe__should_not_implicitly_attach_the_channel_if_options_attachOnSubscribe_is_false()" time="1.0092849731445312">
        </testcase>
        <testcase classname="RealtimeClientChannelTests" name="test__110__Channel__subscribe__should_result_in_an_error_if_channel_is_in_the_FAILED_state_and_options_attachOnSubscribe_is_true()" time="0.016507983207702637">
        </testcase>
        <testcase classname="RealtimeClientChannelTests" name="test__110b__Channel__subscribe__should_not_result_in_an_error_if_channel_is_in_the_FAILED_state_and_options_attachOnSubscribe_is_false()" time="1.0778839588165283">
        </testcase>
        <testcase classname="RealtimeClientChannelTests" name="test__110c__Channel__subscribe__registers_the_listener_even_if_the_channel_is_in_the_FAILED_state()" time="0.3843679428100586">
        </testcase>
        <testcase classname="RealtimeClientChannelTests" name="test__111__Channel__subscribe__should_exist_ensuring_published_messages_are_not_echoed_back_to_the_subscriber_when_echoMessages_is_false()" time="1.524641990661621">
        </testcase>
        <testcase classname="RealtimeClientChannelTests" name="test__112__Channel__subscribe__should_deliver_the_message_even_if_there_is_an_error_while_decoding__using_crypto_data_128()" time="0.35318589210510254">
        </testcase>
        <testcase classname="RealtimeClientChannelTests" name="test__113__Channel__subscribe__should_deliver_the_message_even_if_there_is_an_error_while_decoding__using_crypto_data_256()" time="0.35122907161712646">
        </testcase>
        <testcase classname="RealtimeClientChannelTests" name="test__114__Channel__subscribe__message_cannot_be_decoded_or_decrypted__should_deliver_with_encoding_attribute_set_indicating_the_residual_encoding_and_error_should_be_emitted()" time="0.3475949764251709">
        </testcase>
        <testcase classname="RealtimeClientChannelTests" name="test__115__Channel__unsubscribe__with_no_arguments_unsubscribes_the_provided_listener_to_all_messages_if_subscribed()" time="0.34562695026397705">
        </testcase>
        <testcase classname="RealtimeClientChannelTests" name="test__116__Channel__unsubscribe__with_a_single_name_argument_unsubscribes_the_provided_listener_if_previously_subscribed_with_a_name_specific_subscription()" time="0.34425199031829834">
        </testcase>
        <testcase classname="RealtimeClientChannelTests" name="test__117__Channel__history__should_support_all_the_same_params_as_Rest()" time="0.48302197456359863">
        </testcase>
        <testcase classname="RealtimeClientChannelTests" name="test__118__Channel__history__should_return_a_PaginatedResult_page()" time="0.48707103729248047">
        </testcase>
        <testcase classname="RealtimeClientChannelTests" name="test__119__Channel__history__should_retrieve_all_available_messages()" time="0.7208470106124878">
        </testcase>
        <testcase classname="RealtimeClientChannelTests" name="test__120__Channel__history__attached_channel_may_receive_an_additional_ATTACHED_ProtocolMessage()" time="0.3164680004119873">
        </testcase>
        <testcase classname="RealtimeClientChannelTests" name="test__121__Channel__history__If_an_ERROR_ProtocolMessage_is_received_for_this_channel_then_the_channel_should_immediately_transition_to_the_FAILED_state__the_errorReason_should_be_set_and_an_error_should_be_emitted_on_the_channel()" time="0.3160269260406494">
        </testcase>
        <testcase classname="RealtimeClientChannelTests" name="test__122__Channel__history__should_not_emit_messages_to_subscribers_if_the_channel_is_in_any_state_other_than_ATTACHED()" time="3.4934839010238647">
        </testcase>
        <testcase classname="RealtimeClientChannelTests" name="test__123__Channel__history__supports_the_param_untilAttach__should_be_false_as_default()" time="0.0006039142608642578">
        </testcase>
        <testcase classname="RealtimeClientChannelTests" name="test__124__Channel__history__supports_the_param_untilAttach__should_invoke_an_error_when_the_untilAttach_is_specified_and_the_channel_is_not_attached()" time="0.0015929937362670898">
        </testcase>
        <testcase classname="RealtimeClientChannelTests" name="test__125__Channel__history__supports_the_param_untilAttach__where_value_is_true__should_pass_the_querystring_param_fromSerial_with_the_serial_number_assigned_to_the_channel()" time="0.4810049533843994">
        </testcase>
        <testcase classname="RealtimeClientChannelTests" name="test__126__Channel__history__supports_the_param_untilAttach__where_value_is_false__should_pass_the_querystring_param_fromSerial_with_the_serial_number_assigned_to_the_channel()" time="0.4800339937210083">
        </testcase>
        <testcase classname="RealtimeClientChannelTests" name="test__127__Channel__history__supports_the_param_untilAttach__should_retrieve_messages_prior_to_the_moment_that_the_channel_was_attached()" time="1.0522829294204712">
        </testcase>
        <testcase classname="RealtimeClientChannelTests" name="test__128__Channel__history__if_the_channel_receives_a_server_initiated_DETACHED_message_when__the_channel_is_in_the_ATTACHED_states__an_attempt_to_reattach_the_channel_should_be_made_immediately_by_sending_a_new_ATTACH_message_and_the_channel_should_transition_to_the_ATTACHING_state_with_the_error_emitted_in_the_ChannelStateChange_event()" time="0.3151940107345581">
        </testcase>
        <testcase classname="RealtimeClientChannelTests" name="test__129__Channel__history__if_the_channel_receives_a_server_initiated_DETACHED_message_when__the_channel_is_in_the_SUSPENDED_state__an_attempt_to_reattach_the_channel_should_be_made_immediately_by_sending_a_new_ATTACH_message_and_the_channel_should_transition_to_the_ATTACHING_state_with_the_error_emitted_in_the_ChannelStateChange_event()" time="1.2647730112075806">
        </testcase>
        <testcase classname="RealtimeClientChannelTests" name="test__130__Channel__history__if_the_channel_receives_a_server_initiated_DETACHED_message_when__if_the_attempt_to_re_attach_fails_the_channel_will_transition_to_the_SUSPENDED_state_and_the_error_will_be_emitted_in_the_ChannelStateChange_event()" time="2.2661420106887817">
        </testcase>
        <testcase classname="RealtimeClientChannelTests" name="test__131__Channel__history__if_the_channel_receives_a_server_initiated_DETACHED_message_when__if_the_channel_was_already_in_the_ATTACHING_state__the_channel_will_transition_to_the_SUSPENDED_state_and_the_error_will_be_emitted_in_the_ChannelStateChange_event()" time="0.36635005474090576">
        </testcase>
        <testcase classname="RealtimeClientChannelTests" name="test__131b__Channel__if_the_channel_receives_a_server_initiated_DETACHED_message_and_if_the_attempt_to_reattach_fails_then_the_channel_will_transition_to_SUSPENDED_state_with_periodic_reattach_with_channelRetryTimeout()" time="12.732017040252686">
        </testcase>
        <testcase classname="RealtimeClientChannelTests" name="test__132__Channel__history__if_the_channel_receives_a_server_initiated_DETACHED_message_when__if_the_connection_is_no_longer_CONNECTED__then_the_automatic_attempts_to_re_attach_the_channel_must_be_cancelled()" time="1.3703049421310425">
        </testcase>
        <testcase classname="RealtimeClientChannelTests" name="test__133__Channel__history__Channel_options__setOptions__should_send_an_ATTACH_message_with_params___modes_if_the_channel_is_attached()" time="0.38349592685699463">
        </testcase>
        <testcase classname="RealtimeClientChannelTests" name="test__134__Channel__history__Channel_options__setOptions__should_send_an_ATTACH_message_with_params___modes_if_the_channel_is_attaching()" time="0.3480030298233032">
        </testcase>
        <testcase classname="RealtimeClientChannelTests" name="test__135__Channel__history__Channel_options__setOptions__should_success_immediately_if_channel_is_not_attaching_or_attached()" time="0.0011548995971679688">
        </testcase>
        <testcase classname="RealtimeClientChannelTests" name="test__136__Channel__history__Channel_options__setOptions__should_fail_if_the_attach_moves_to_FAILED()" time="0.4604339599609375">
        </testcase>
        <testcase classname="RealtimeClientChannelTests" name="test__137__Channel__history__Channel_options__setOptions__should_fail_if_the_attach_moves_to_DETACHED()" time="0.32105588912963867">
        </testcase>
        <testcase classname="RealtimeClientChannelTests" name="test__138__Channel__crypto__if_configured_for_encryption__channels_encrypt_and_decrypt_messages__data()" time="1.021939992904663">
        </testcase>
        <testcase classname="RealtimeClientChannelTests" name="test__139__message_attributes__if_the_message_does_not_contain_an_id__it_should_be_set_to_protocolMsgId_index()" time="0.3163110017776489">
        </testcase>
        <testcase classname="RealtimeClientChannelTests" name="test__140__ChannelOptions__options_provided_when_instantiating_a_channel_should_be_frozen()" time="0.0056879520416259766">
        </testcase>
        <testcase classname="RealtimeClientChannelTests" name="test__141__ChannelOptions__on_ATTACHED_should_decode_flags_into_array_of_channel_modes()" time="0.0011730194091796875">
        </testcase>
        <testcase classname="RealtimeClientChannelTests" name="test__142__publish__with_resultCallback__returns_valid_PublishResult_with_message_serials()" time="0.3279709815979004">
        </testcase>
        <testcase classname="RealtimeClientChannelTests" name="test__200__channel_serial_is_updated_whenever_a_protocol_message_with_either_message_presence_or_attached_actions_is_received_in_a_channel()" time="0.47354400157928467">
        </testcase>
        <testcase classname="RealtimeClientChannelTests" name="test__201__channel_serial_is_cleared_whenever_a_channel_entered_into_detached_suspended_or_failed_state()" time="0.5390269756317139">
        </testcase>
        <testcase classname="RealtimeClientChannelTests" name="test__202__Channel__attach__protocol_message_channelSerial_must_be_set_to_channelSerial_of_the_most_recent_protocol_message_or_omitted_if_no_previous_protocol_message_received()" time="0.8201470375061035">
        </testcase>
        <testcase classname="RealtimeClientChannelTests" name="test__Channel_options__setOptions__shouldUpdateOptionsOfRestChannel()" time="0.24623799324035645">
        </testcase>
        <testcase classname="RealtimeClientChannelTests" name="test_Channel_should_ignore_protocol_messages_with_Object_and_ObjectSync_actions_when_LiveObjects_plugin_not_provided()" time="0.4021289348602295">
        </testcase>
        <testcase classname="RealtimeClientChannelTests" name="test_channelSerial_isUpdatedByObjectProtocolMessage()" time="0.3161330223083496">
        </testcase>
        <testcase classname="RealtimeClientChannelsTests" name="test__001__Channels__should_exist_methods_to_check_if_a_channel_exists_or_iterate_through_the_existing_channels()" time="0.00421595573425293">
        </testcase>
        <testcase classname="RealtimeClientChannelsTests" name="test__002__Channels__get__should_create_a_new_Channel_if_none_exists_or_return_the_existing_one()" time="0.0018810033798217773">
        </testcase>
        <testcase classname="RealtimeClientChannelsTests" name="test__003__Channels__get__should_be_possible_to_specify_a_ChannelOptions()" time="0.0020520687103271484">
        </testcase>
        <testcase classname="RealtimeClientChannelsTests" name="test__004__Channels__get__accessing_an_existing_Channel_with_options_should_update_the_options_and_then_return_the_object()" time="0.004238009452819824">
        </testcase>
        <testcase classname="RealtimeClientChannelsTests" name="test__005__Channels__release__should_release_a_channel()" time="1.0156680345535278">
        </testcase>
        <testcase classname="RealtimeClientConnectionTests" name="test__001__Connection__should_connect_automatically()" time="0.2537660598754883">
        </testcase>
        <testcase classname="RealtimeClientConnectionTests" name="test__002__Connection__should_connect_manually()" time="2.3120440244674683">
        </testcase>
        <testcase classname="RealtimeClientConnectionTests" name="test__003__Connection__API_version_param_must_be_included_in_all_connections()" time="0.006991028785705566">
        </testcase>
        <testcase classname="RealtimeClientConnectionTests" name="test__004__Connection__Library_and_version_param__agent__should_include_the__Ably_Agent__header_value()" time="0.26496803760528564">
        </testcase>
        <testcase classname="RealtimeClientConnectionTests" name="test__005__Connection__basic_operations_should_work_simultaneously()" time="0.9952489137649536">
        </testcase>
        <testcase classname="RealtimeClientConnectionTests" name="test__006__Connection__should_have_an_opened_websocket_connection_and_received_a_CONNECTED_ProtocolMessage()" time="0.2732980251312256">
        </testcase>
        <testcase classname="RealtimeClientConnectionTests" name="test__007__Connection__should_make_a_new_connection_with_a_new_transport_instance_if_the_state_is_CLOSING()" time="0.51282799243927">
        </testcase>
        <testcase classname="RealtimeClientConnectionTests" name="test__008__Connection__it_should_make_sure_that__when_the_CLOSED_ProtocolMessage_arrives_for_the_old_connection__it_doesn_t_affect_the_new_one()" time="0.50621497631073">
        </testcase>
        <testcase classname="RealtimeClientConnectionTests" name="test__009__Connection__should_enter_FAILED_state_when_API_key_is_invalid()" time="0.2511240243911743">
        </testcase>
        <testcase classname="RealtimeClientConnectionTests" name="test__010__Connection__attributes_within_ConnectionDetails_should_be_used_as_defaults()" time="0.40971803665161133">
        </testcase>
        <testcase classname="RealtimeClientConnectionTests" name="test__011__Connection__should_disconnect_the_transport_when_no_activity_exist()" time="4.829015016555786">
        </testcase>
        <testcase classname="RealtimeClientConnectionTests" name="test__012__Connection__the_client_may_receive_a_CONNECTED_ProtocolMessage_from_Ably_at_any_point_and_should_emit_an_UPDATE_event()" time="0.7781360149383545">
        </testcase>
        <testcase classname="RealtimeClientConnectionTests" name="test__013__Connection__should_set_the_Connection_reason_attribute_based_on_the_Error_member_of_the_CONNECTED_ProtocolMessage()" time="0.41138601303100586">
        </testcase>
        <testcase classname="RealtimeClientConnectionTests" name="test__014__Connection__should_not_move_to_FAILED_if_received_DISCONNECT_with_an_error()" time="0.2550560235977173">
        </testcase>
        <testcase classname="RealtimeClientConnectionTests" name="test__015__Connection__should_abort_reconnection_with_new_token_if_the_server_has_requested_it_to_authorize_and_after_it_the_connection_has_been_closed()" time="0.3171060085296631">
        </testcase>
        <testcase classname="RealtimeClientConnectionTests" name="test__016__Connection__ConnectionDetails__maxMessageSize_overrides_the_default_maxMessageSize()" time="0.2506159543991089">
        </testcase>
        <testcase classname="RealtimeClientConnectionTests" name="test__017__Connection__url__should_connect_to_the_default_host()" time="0.0017559528350830078">
        </testcase>
        <testcase classname="RealtimeClientConnectionTests" name="test__018__Connection__url__should_connect_with_query_string_params()" time="0.25065696239471436">
        </testcase>
        <testcase classname="RealtimeClientConnectionTests" name="test__019__Connection__url__should_connect_with_query_string_params_including_clientId()" time="0.4167400598526001">
        </testcase>
        <testcase classname="RealtimeClientConnectionTests" name="test__020__Connection__event_emitter__should_emit_events_for_state_changes()" time="0.9094549417495728">
        </testcase>
        <testcase classname="RealtimeClientConnectionTests" name="test__021__Connection__event_emitter__should_never_emit_a_ConnectionState_event_for_a_state_equal_to_the_previous_state()" time="0.4951130151748657">
        </testcase>
        <testcase classname="RealtimeClientConnectionTests" name="test__021b__Connection__event_emitter__should_never_emit_a_ConnectionState_event_for_a_state_equal_to_the_previous_state_CONNECTING()" time="0.24496996402740479">
        </testcase>
        <testcase classname="RealtimeClientConnectionTests" name="test__022__Connection__event_emitter__should_emit_states_on_a_new_connection()" time="0.2554459571838379">
        </testcase>
        <testcase classname="RealtimeClientConnectionTests" name="test__023__Connection__event_emitter__should_emit_states_when_connection_is_closed()" time="0.30896997451782227">
        </testcase>
        <testcase classname="RealtimeClientConnectionTests" name="test__024__Connection__event_emitter__should_have_the_current_state()" time="0.2476879358291626">
        </testcase>
        <testcase classname="RealtimeClientConnectionTests" name="test__025__Connection__event_emitter__should_have_a_ConnectionStateChange_as_first_argument_for_every_connection_state_change()" time="0.25412893295288086">
        </testcase>
        <testcase classname="RealtimeClientConnectionTests" name="test__026__Connection__event_emitter__should_have_the_reason_which_contains_an_ErrorInfo()" time="0.2589390277862549">
        </testcase>
        <testcase classname="RealtimeClientConnectionTests" name="test__027__Connection__event_emitter__any_state_change_triggered_by_a_ProtocolMessage_that_contains_an_Error_member_should_populate_the_Reason_property()" time="0.4040670394897461">
        </testcase>
        <testcase classname="RealtimeClientConnectionTests" name="test__028__Connection__ACK_and_NACK__should_expect_either_an_ACK_or_NACK_to_confirm__successful_receipt_and_acceptance_of_message()" time="0.38964295387268066">
        </testcase>
        <testcase classname="RealtimeClientConnectionTests" name="test__029__Connection__ACK_and_NACK__should_expect_either_an_ACK_or_NACK_to_confirm__successful_receipt_and_acceptance_of_presence()" time="0.39350998401641846">
        </testcase>
        <testcase classname="RealtimeClientConnectionTests" name="test__030__Connection__ACK_and_NACK__should_expect_either_an_ACK_or_NACK_to_confirm__message_failure()" time="0.7177020311355591">
        </testcase>
        <testcase classname="RealtimeClientConnectionTests" name="test__031__Connection__ACK_and_NACK__should_expect_either_an_ACK_or_NACK_to_confirm__presence_failure()" time="0.3842350244522095">
        </testcase>
        <testcase classname="RealtimeClientConnectionTests" name="test__032__Connection__ACK_and_NACK__ProtocolMessage__should_contain_unique_serially_incrementing_msgSerial_along_with_the_count()" time="0.9247510433197021">
        </testcase>
        <testcase classname="RealtimeClientConnectionTests" name="test__033__Connection__ACK_and_NACK__ProtocolMessage__should_continue_incrementing_msgSerial_serially_if_the_connection_resumes_successfully()" time="5.629567980766296">
        </testcase>
        <testcase classname="RealtimeClientConnectionTests" name="test__034__Connection__ACK_and_NACK__ProtocolMessage__should_reset_msgSerial_serially_if_the_connection_does_not_resume()" time="1.3428750038146973">
        </testcase>
        <testcase classname="RealtimeClientConnectionTests" name="test__035__Connection__ACK_and_NACK__should_trigger_the_failure_callback_for_the_remaining_pending_messages_if__connection_is_closed()" time="2.447283983230591">
        </testcase>
        <testcase classname="RealtimeClientConnectionTests" name="test__036__Connection__ACK_and_NACK__should_trigger_the_failure_callback_for_the_remaining_pending_messages_if__connection_state_enters_FAILED()" time="1.325355052947998">
        </testcase>
        <testcase classname="RealtimeClientConnectionTests" name="test__038__Connection__connection_id__should_be_null_until_connected()" time="0.24939203262329102">
        </testcase>
        <testcase classname="RealtimeClientConnectionTests" name="test__039__Connection__connection_id__should_have_unique_IDs()" time="0.42662501335144043">
        </testcase>
        <testcase classname="RealtimeClientConnectionTests" name="test__040__Connection__connection_key__should_be_null_until_connected()" time="0.2827080488204956">
        </testcase>
        <testcase classname="RealtimeClientConnectionTests" name="test__041__Connection__connection_key__should_have_unique_connection_keys()" time="0.4364199638366699">
        </testcase>
        <testcase classname="RealtimeClientConnectionTests" name="test__045__Connection__close__if_CONNECTING__do_the_operation_once_CONNECTED()" time="0.32799994945526123">
        </testcase>
        <testcase classname="RealtimeClientConnectionTests" name="test__046__Connection__close__if_CONNECTED__should_send_a_CLOSE_action__change_state_to_CLOSING_and_receive_a_CLOSED_action()" time="0.3086169958114624">
        </testcase>
        <testcase classname="RealtimeClientConnectionTests" name="test__047__Connection__close__should_transition_to_CLOSED_action_when_the_close_process_timeouts()" time="0.3149869441986084">
        </testcase>
        <testcase classname="RealtimeClientConnectionTests" name="test__048__Connection__close__transitions_to_the_CLOSING_state_and_then_to_the_CLOSED_state_if_the_transport_is_abruptly_closed()" time="0.3183540105819702">
        </testcase>
        <testcase classname="RealtimeClientConnectionTests" name="test__049__Connection__close__if_DISCONNECTED__aborts_the_retry_and_moves_immediately_to_CLOSED()" time="1.8472709655761719">
        </testcase>
        <testcase classname="RealtimeClientConnectionTests" name="test__050__Connection__close__if_SUSPENDED__aborts_the_retry_and_moves_immediately_to_CLOSED()" time="1.7587080001831055">
        </testcase>
        <testcase classname="RealtimeClientConnectionTests" name="test__051__Connection__ping__fails_if_in_the_INITIALIZED__SUSPENDED__CLOSING__CLOSED_or_FAILED_state()" time="0.6764019727706909">
        </testcase>
        <testcase classname="RealtimeClientConnectionTests" name="test__052__Connection__ping__should_send_a_ProtocolMessage_with_action_HEARTBEAT_and_expects_a_HEARTBEAT_message_in_response()" time="0.31002700328826904">
        </testcase>
        <testcase classname="RealtimeClientConnectionTests" name="test__053__Connection__ping__should_fail_if_a_HEARTBEAT_ProtocolMessage_is_not_received_within_the_default_realtime_request_timeout()" time="3.2782970666885376">
        </testcase>
        <testcase classname="RealtimeClientConnectionTests" name="test__054__Connection__connection_request_fails__on_DISCONNECTED_after_CONNECTED__should_not_emit_error_with_a_renewable_token()" time="3.029331922531128">
        </testcase>
        <testcase classname="RealtimeClientConnectionTests" name="test__055__Connection__connection_request_fails__on_token_error_while_CONNECTING__reissues_token_and_reconnects()" time="4.984120965003967">
        </testcase>
        <testcase classname="RealtimeClientConnectionTests" name="test__056__Connection__connection_request_fails__should_transition_to_disconnected_when_the_token_renewal_fails()" time="2.637468934059143">
        </testcase>
        <testcase classname="RealtimeClientConnectionTests" name="test__057__Connection__connection_request_fails__should_transition_to_Failed_state_because_the_token_is_invalid_and_not_renewable()" time="3.6131240129470825">
        </testcase>
        <testcase classname="RealtimeClientConnectionTests" name="test__058__Connection__connection_request_fails__connection_attempt_should_fail_if_not_connected_within_the_default_realtime_request_timeout()" time="0.5320889949798584">
        </testcase>
        <testcase classname="RealtimeClientConnectionTests" name="test__059__Connection__connection_request_fails__connection_attempt_fails_for_any_recoverable_reason__for_example_a_timeout()" time="13.942394018173218">
        </testcase>
        <testcase classname="RealtimeClientConnectionTests" name="test__059b__Connection__connection_request_fails__connection_attempt_fails_for_any_recoverable_reason__for_example_an_hostUnreachable_transport_error()" time="19.288753032684326">
        </testcase>
        <testcase classname="RealtimeClientConnectionTests" name="test__060__Connection__connection_request_fails__connection_state_has_been_in_the_DISCONNECTED_state_for_more_than_the_default_connectionStateTtl_should_change_the_state_to_SUSPENDED()" time="1.0703339576721191">
        </testcase>
        <testcase classname="RealtimeClientConnectionTests" name="test__061__Connection__connection_request_fails__should_change_the_state_to_SUSPENDED_when_the_connection_state_has_been_in_the_DISCONNECTED_state_for_more_than_the_connectionStateTtl()" time="13.071774959564209">
        </testcase>
        <testcase classname="RealtimeClientConnectionTests" name="test__062__Connection__connection_request_fails__on_CLOSE_the_connection_should_stop_connection_retries()" time="3.6935200691223145">
        </testcase>
        <testcase classname="RealtimeClientConnectionTests" name="test__064__Connection__connection_failures_once_CONNECTED__if_a_Connection_transport_is_disconnected_unexpectedly_or_if_a_token_expires__then_the_Connection_manager_will_immediately_attempt_to_reconnect()" time="1.6202760934829712">
        </testcase>
        <testcase classname="RealtimeClientConnectionTests" name="test__065__Connection__connection_failures_once_CONNECTED__should_recover_from_disconnection_and_messages_should_be_delivered_once_the_connection_is_resumed()" time="0.7529619932174683">
        </testcase>
        <testcase classname="RealtimeClientConnectionTests" name="test__066__Connection__connection_failures_once_CONNECTED__ACK_and_NACK_responses_for_published_messages_can_only_ever_be_received_on_the_transport_connection_on_which_those_messages_were_sent()" time="0.6840620040893555">
        </testcase>
        <testcase classname="RealtimeClientConnectionTests" name="test__067__Connection__connection_failures_once_CONNECTED__reconnects_to_the_websocket_endpoint_with_additional_querystring_params__resume_is_the_private_connection_key_from_the_most_recent_CONNECTED_ProtocolMessage_received()" time="0.6260889768600464">
        </testcase>
        <testcase classname="RealtimeClientConnectionTests" name="test__068a__Connection__connection_failures_once_CONNECTED__System_s_response_to_a_resume_request__CONNECTED_ProtocolMessage_with_the_same_connectionId_as_the_current_client__and_no_error()" time="0.613548994064331">
        </testcase>
        <testcase classname="RealtimeClientConnectionTests" name="test__068b__Connection__connection_failures_once_CONNECTED__System_s_response_to_a_resume_request__CONNECTED_ProtocolMessage_with_the_same_connectionId_as_the_current_client__and_no_error()" time="0.7145289182662964">
        </testcase>
        <testcase classname="RealtimeClientConnectionTests" name="test__068c__Connection__connection_failures_once_CONNECTED__System_s_response_to_a_resume_request__CONNECTED_ProtocolMessage_with_the_same_connectionId_as_the_current_client__and_no_error()" time="10.679785966873169">
        </testcase>
        <testcase classname="RealtimeClientConnectionTests" name="test__069__Connection__connection_failures_once_CONNECTED__System_s_response_to_a_resume_request__CONNECTED_ProtocolMessage_with_the_different_connectionId_than_the_current_client_and_an_non_fatal_error()" time="0.6683880090713501">
        </testcase>
        <testcase classname="RealtimeClientConnectionTests" name="test__071__Connection__connection_failures_once_CONNECTED__System_s_response_to_a_resume_request__ERROR_ProtocolMessage_indicating_a_fatal_error_in_the_connection()" time="0.3536820411682129">
        </testcase>
        <testcase classname="RealtimeClientConnectionTests" name="test__072__Connection__connection_failures_once_CONNECTED__System_s_response_to_a_resume_request__should_resume_the_connection_after_an_auth_renewal()" time="5.194419980049133">
        </testcase>
        <testcase classname="RealtimeClientConnectionTests" name="test__073__Connection__connection_failures_once_CONNECTED__when_a_connection_is_resumed__the_connection_key_may_change_and_will_be_provided_in_the_first_CONNECTED_ProtocolMessage_connectionDetails()" time="0.6697160005569458">
        </testcase>
        <testcase classname="RealtimeClientConnectionTests" name="test__074__Connection__connection_failures_once_CONNECTED__when_connection__ttl_plus_idle_interval__period_has_passed_since_last_activity__uses_a_new_connection()" time="6.026098012924194">
        </testcase>
        <testcase classname="RealtimeClientConnectionTests" name="test__075__Connection__connection_failures_once_CONNECTED__when_connection__ttl_plus_idle_interval__period_has_passed_since_last_activity__reattaches_to_the_same_channels_after_a_new_connection_has_been_established()" time="5.970798015594482">
        </testcase>
        <testcase classname="RealtimeClientConnectionTests" name="test__076__Connection__connection_failures_once_CONNECTED__when_connection__ttl_plus_idle_interval__period_has_NOT_passed_since_last_activity__uses_the_same_connection()" time="0.5985219478607178">
        </testcase>
        <testcase classname="RealtimeClientConnectionTests" name="test__077__Connection__connection_failures_once_CONNECTED__DISCONNECTED_message_contains_a_token_error__if_the_token_is_renewable_then_error_should_not_be_emitted()" time="2.0932810306549072">
        </testcase>
        <testcase classname="RealtimeClientConnectionTests" name="test__078__Connection__connection_failures_once_CONNECTED__DISCONNECTED_message_contains_a_token_error__and_the_library_does_not_have_a_means_to_renew_the_token__the_connection_will_transition_to_the_FAILED_state()" time="2.6353710889816284">
        </testcase>
        <testcase classname="RealtimeClientConnectionTests" name="test__079__Connection__connection_failures_once_CONNECTED__DISCONNECTED_message_contains_a_token_error__should_transition_to_disconnected_when_the_token_renewal_fails_and_the_error_should_be_emitted()" time="3.002838969230652">
        </testcase>
        <testcase classname="RealtimeClientConnectionTests" name="test__080__Connection__Connection_recovery__connection_state_should_recover_explicitly_with_a_recover_key()" time="1.2299630641937256">
        </testcase>
        <testcase classname="RealtimeClientConnectionTests" name="test__082__Connection__Connection_recovery__when_a_connection_is_successfully_recovered__Connection_id_will_be_identical_to_the_id_of_the_connection_that_was_recovered_and_Connection_key_will_always_be_updated_to_the_ConnectionDetails_connectionKey_provided_in_the_first_CONNECTED_ProtocolMessage()" time="0.5084309577941895">
        </testcase>
        <testcase classname="RealtimeClientConnectionTests" name="test__085__Connection__Connection_recovery__should_set_internal_message_serial_to_component_in_recovery_key()" time="0.40032899379730225">
        </testcase>
        <testcase classname="RealtimeClientConnectionTests" name="test__086__Connection__Connection_recovery__library_should_create_channel_with_corresponding_serial_in_given_recovery_key()" time="0.5751199722290039">
        </testcase>
        <testcase classname="RealtimeClientConnectionTests" name="test__086a__Connection__Host_Fallback__failing_connections_with_custom_endpoint_should_result_in_an_error_immediately()" time="0.10648894309997559">
        </testcase>
        <testcase classname="RealtimeClientConnectionTests" name="test__086b__Connection__Host_Fallback__failing_connections_with_custom_port_should_result_in_an_error_immediately()" time="0.1140289306640625">
        </testcase>
        <testcase classname="RealtimeClientConnectionTests" name="test__086c__Connection__Host_Fallback__failing_connections_with_custom_tlsPort_should_result_in_an_error_immediately()" time="0.1038980484008789">
        </testcase>
        <testcase classname="RealtimeClientConnectionTests" name="test__087__Connection__Host_Fallback__failing_connections_with_custom_endpoint_should_result_in_time_outs()" time="0.10468602180480957">
        </testcase>
        <testcase classname="RealtimeClientConnectionTests" name="test__089__Connection__Host_Fallback__applies_when_an_array_of_ClientOptions_fallbackHosts_is_provided()" time="1.230172038078308">
        </testcase>
        <testcase classname="RealtimeClientConnectionTests" name="test__090__Connection__Connection_recovery__library_provides_additional_querystring_when_recover_is_provided()" time="0.614549994468689">
        </testcase>
        <testcase classname="RealtimeClientConnectionTests" name="test__090__Connection__Host_Fallback__should_not_use_an_alternative_host_when_the_client_receives_a_bad_request()" time="0.9525569677352905">
        </testcase>
        <testcase classname="RealtimeClientConnectionTests" name="test__091__Connection__Host_Fallback__every_connection_is_first_attempted_to_the_primary_host_default_endpoint()" time="0.33785390853881836">
        </testcase>
        <testcase classname="RealtimeClientConnectionTests" name="test__091__Connection__Host_Fallback__every_connection_is_first_attempted_to_the_primary_host_nonprod_endpoint()" time="0.3373990058898926">
        </testcase>
        <testcase classname="RealtimeClientConnectionTests" name="test__092__Connection__Host_Fallback__should_retry_hosts_in_random_order_after_checkin_if_an_internet_connection_is_available_default_endpoint()" time="1.236199975013733">
        </testcase>
        <testcase classname="RealtimeClientConnectionTests" name="test__092__Connection__Host_Fallback__should_retry_hosts_in_random_order_after_checkin_if_an_internet_connection_is_available_nonprod_endpoint()" time="1.2167670726776123">
        </testcase>
        <testcase classname="RealtimeClientConnectionTests" name="test__093__Connection__Host_Fallback__doesn_t_try_fallback_host_if_Internet_connection_check_fails()" time="0.10440301895141602">
        </testcase>
        <testcase classname="RealtimeClientConnectionTests" name="test__093b__Connection__Host_Fallback__connectivity_check_requests_the_default_URL()" time="0.0013450384140014648">
        </testcase>
        <testcase classname="RealtimeClientConnectionTests" name="test__093c__Connection__Host_Fallback__connectivity_check_requests_ClientOptions_connectivityCheckUrl()" time="0.0009920597076416016">
        </testcase>
        <testcase classname="RealtimeClientConnectionTests" name="test__093d__Connection__Host_Fallback__connectivity_check_fails_unless_the_body_is_yes()" time="0.0008859634399414062">
        </testcase>
        <testcase classname="RealtimeClientConnectionTests" name="test__094__Connection__Host_Fallback__should_retry_custom_fallback_hosts_in_random_order_after_checkin_if_an_internet_connection_is_available()" time="1.2249200344085693">
        </testcase>
        <testcase classname="RealtimeClientConnectionTests" name="test__095__Connection__Host_Fallback__won_t_use_fallback_hosts_feature_if_an_empty_array_is_provided()" time="0.10544896125793457">
        </testcase>
        <testcase classname="RealtimeClientConnectionTests" name="test__096__Connection__Host_Fallback__client_is_connected_to_a_fallback_host_endpoint_should_do_HTTP_requests_to_the_same_data_centre()" time="0.3466140031814575">
        </testcase>
        <testcase classname="RealtimeClientConnectionTests" name="test__097__Connection__Host_Fallback__should_use_an_alternative_host_when___hostUnreachable()" time="0.3700369596481323">
        </testcase>
        <testcase classname="RealtimeClientConnectionTests" name="test__098__Connection__Host_Fallback__should_use_an_alternative_host_when___requestTimeout()" time="0.5908989906311035">
        </testcase>
        <testcase classname="RealtimeClientConnectionTests" name="test__099__Connection__Host_Fallback__should_use_an_alternative_host_when___hostInternalError_code__501()" time="0.3689439296722412">
        </testcase>
        <testcase classname="RealtimeClientConnectionTests" name="test__100__Connection__Host_Fallback__should_move_to_disconnected_when_there_s_no_internet__with_NSPOSIXErrorDomain_with_code_57()" time="0.24472594261169434">
        </testcase>
        <testcase classname="RealtimeClientConnectionTests" name="test__101__Connection__Host_Fallback__should_move_to_disconnected_when_there_s_no_internet__with_NSPOSIXErrorDomain_with_code_50()" time="0.24231493473052979">
        </testcase>
        <testcase classname="RealtimeClientConnectionTests" name="test__102__Connection__Host_Fallback__should_move_to_disconnected_when_there_s_no_internet__with_any_kCFErrorDomainCFNetwork()" time="0.2440730333328247">
        </testcase>
        <testcase classname="RealtimeClientConnectionTests" name="test__103a__Connection__Transport_disconnected_side_effects__should_resend_any_ProtocolMessage_by_processing_connection_wide_pending_messages()" time="0.7306289672851562">
        </testcase>
        <testcase classname="RealtimeClientConnectionTests" name="test__103b__Connection__Transport_disconnected_side_effects_message_serial_for_pending_message_must_remain_the_same_that_is_awaiting_a_ACK_NACK()" time="1.3259159326553345">
        </testcase>
        <testcase classname="RealtimeClientConnectionTests" name="test__103c__Connection__Transport_disconnected_side_effects_message_must_be_assigned_a_new_msgSerial_from_the_internal_msgSerial()" time="1.3729760646820068">
        </testcase>
        <testcase classname="RealtimeClientConnectionTests" name="test__104__Connection__Transport_disconnected_side_effects__should_resend_the_ATTACH_message_if_there_are_any_pending_channels()" time="0.670225977897644">
        </testcase>
        <testcase classname="RealtimeClientConnectionTests" name="test__106__Connection__Operating_System_events_for_network_internet_connectivity_changes__should_immediately_attempt_to_connect_if_the_operating_system-indicates_that_the_underlying_internet_connection_is_now_available_when_DISCONNECTED_or_SUSPENDED()" time="0.24644804000854492">
        </testcase>
        <testcase classname="RealtimeClientConnectionTests" name="test__106_b__Connection__Operating_System_events_for_network_internet_connectivity_changes__should_restart_the_pending_connection_attempt_if_the_operating_system-indicates_that_the_underlying_internet_connection_is_now_available_when_CONNECTING()" time="0.4990410804748535">
        </testcase>
        <testcase classname="RealtimeClientConnectionTests" name="test__107__Connection__Operating_System_events_for_network_internet_connectivity_changes__Ably_can_request_that_a_connected_client_re_authenticates_by_sending_the_client_an_AUTH_ProtocolMessage()" time="0.7763019800186157">
        </testcase>
        <testcase classname="RealtimeClientConnectionTests" name="test__108__Connection__Operating_System_events_for_network_internet_connectivity_changes__re_authenticate_and_resume_the_connection_when_the_client_is_forcibly_disconnected_following_a_DISCONNECTED_message_containing_an_error_code_greater_than_or_equal_to_40140_and_less_than_40150()" time="5.2139140367507935">
        </testcase>
        <testcase classname="RealtimeClientConnectionTests" name="test__109__Connection__Operating_System_events_for_network_internet_connectivity_changes__should_immediately_change_the_state_to_DISCONNECTED_if_the_operating_system-indicates_that_the_underlying_internet_connection_is_no_longer_available__when_CONNECTING()" time="0.0014150142669677734">
        </testcase>
        <testcase classname="RealtimeClientConnectionTests" name="test__110__Connection__Connection_recovery__connection_recovery_key_is_correctly_constructed_from_defined_parts()" time="0.4209998846054077">
        </testcase>
        <testcase classname="RealtimeClientConnectionTests" name="test__110__Connection__Operating_System_events_for_network_internet_connectivity_changes__should_immediately_change_the_state_to_DISCONNECTED_if_the_operating_system-indicates_that_the_underlying_internet_connection_is_no_longer_available__when_CONNECTED()" time="0.24406397342681885">
        </testcase>
        <testcase classname="RealtimeClientConnectionTests" name="test__111__Connection__Connection_recovery__connection_recovery_key_is_properly_serializing_any_unicode_channel_name()" time="0.4373281002044678">
        </testcase>
        <testcase classname="RealtimeClientConnectionTests" name="test__111__Connection__with_fixture_messages__should_encode_and_decode_fixture_messages_as_expected()" time="6.663678050041199">
        </testcase>
        <testcase classname="RealtimeClientConnectionTests" name="test__112__Connection__Connection_recovery__connection_recovery_key_is_null_when_connection_is_in_invalid_state()" time="0.31133806705474854">
        </testcase>
        <testcase classname="RealtimeClientConnectionTests" name="test__112__Connection__with_fixture_messages__should_send_messages_through_raw_JSON_POST_and_retrieve_equal_messages_through_MsgPack_and_JSON()" time="0.7621990442276001">
        </testcase>
        <testcase classname="RealtimeClientConnectionTests" name="test__113__Connection__Connection_recovery__connection_recovery_key_is_null_when_connection_is_in_suspended_state()" time="0.24736297130584717">
        </testcase>
        <testcase classname="RealtimeClientConnectionTests" name="test__113__Connection__with_fixture_messages__should_send_messages_through_MsgPack_and_JSON_and_retrieve_equal_messages_through_raw_JSON_GET()" time="12.211770057678223">
        </testcase>
        <testcase classname="RealtimeClientConnectionTests" name="test__114__Connection__Connection_recovery__connection_recovery_key_is_null_when_connection_is_in_failed_state()" time="0.24815499782562256">
        </testcase>
        <testcase classname="RealtimeClientConnectionTests" name="test__139__Connection__connection_id_and_key__should_be_nil_when_sdk_is_in_CLOSING_and_CLOSED_states()" time="0.31334400177001953">
        </testcase>
        <testcase classname="RealtimeClientConnectionTests" name="test__140__Connection__connection_id_and_key__should_be_nil_when_sdk_is_in_SUSPENDED_state()" time="0.24716401100158691">
        </testcase>
        <testcase classname="RealtimeClientConnectionTests" name="test__141__Connection__connection_id_and_key__should_be_nil_when_sdk_is_in_FAILED_state()" time="0.24978399276733398">
        </testcase>
        <testcase classname="RealtimeClientConnectionTests" name="test__200a__Connection__Connection_recovery__failures_system-response_to_unrecoverable_token_error()" time="0.6524840593338013">
        </testcase>
        <testcase classname="RealtimeClientConnectionTests" name="test__200b__Connection__Connection_recovery__failures_system-response_to_unrecoverable_token_error()" time="1.0424050092697144">
        </testcase>
        <testcase classname="RealtimeClientConnectionTests" name="test__200c__Connection__Connection_recovery__failures_system-response_to_unrecoverable_token_error()" time="1.0456039905548096">
        </testcase>
        <testcase classname="RealtimeClientConnectionTests" name="test__201__Connection__Connection_recovery__failures_once_CONNECTED__System_s_response_to_a_resume_request__CONNECTED_ProtocolMessage_with_the_different_connectionId_than_the_current_client_and_an_non_fatal_error()" time="0.48816001415252686">
        </testcase>
        <testcase classname="RealtimeClientConnectionTests" name="test__202__Connection__Connection_recovery__failures_with_any_other_fatal_error_in_the_connection()" time="0.6525239944458008">
        </testcase>
        <testcase classname="RealtimeClientPresenceTests" name="test__002__Presence__should_receive_all_250_members()" time="125.4402369260788">
        </testcase>
        <testcase classname="RealtimeClientPresenceTests" name="test__003__Presence__should_be_used_a_PresenceMap_to_maintain_a_list_of_members()" time="50.328715085983276">
        </testcase>
        <testcase classname="RealtimeClientPresenceTests" name="test__004__Presence__callback_can_be_provided_that_will_be_called_upon_success()" time="0.3870190382003784">
        </testcase>
        <testcase classname="RealtimeClientPresenceTests" name="test__005__Presence__callback_can_be_provided_that_will_be_called_upon_failure()" time="0.5079609155654907">
        </testcase>
        <testcase classname="RealtimeClientPresenceTests" name="test__006__Presence__should_also_ensure_that_using_updateClient_has_no_side_effects_on_a_client_that_has_entered_normally_using_Presence_enter()" time="0.8928639888763428">
        </testcase>
        <testcase classname="RealtimeClientPresenceTests" name="test__007__Presence__should_indicate_an_error_if_the_client_is_identified_and_has_a_valid_clientId_and_the_clientId_argument_does_not_match_the_client_s_clientId()" time="0.46128106117248535">
        </testcase>
        <testcase classname="RealtimeClientPresenceTests" name="test__008__Presence__Presence_syncComplete_returns_true_if_the_initial_SYNC_operation_has_completed()" time="125.54800403118134">
        </testcase>
        <testcase classname="RealtimeClientPresenceTests" name="test__010__Presence__ProtocolMessage_bit_flag__when_members_are_present()" time="125.442950963974">
        </testcase>
        <testcase classname="RealtimeClientPresenceTests" name="test__011__Presence__realtime_system-reserves_the_right_to_initiate_a_sync_of_the_presence_members_at_any_point_once_a_channel_is_attached__should_do_a_new_sync_whenever_a_SYNC_ProtocolMessage_is_received_with_a_channel_attribute_and_a_new_sync_sequence_identifier_in_the_channelSerial_attribute()" time="0.9650230407714844">
        </testcase>
        <testcase classname="RealtimeClientPresenceTests" name="test__012__Presence__realtime_system-reserves_the_right_to_initiate_a_sync_of_the_presence_members_at_any_point_once_a_channel_is_attached__when_a_SYNC_is_sent_with_no_channelSerial_attribute_then_the_sync_data_is_entirely_contained_within_that_ProtocolMessage()" time="0.4526630640029907">
        </testcase>
        <testcase classname="RealtimeClientPresenceTests" name="test__013__Presence__PresenceMap_has_existing_members_when_a_SYNC_is_started__should_ensure_that_members_no_longer_present_on_the_channel_are_removed_from_the_local_PresenceMap_once_the_sync_is_complete()" time="1.3009179830551147">
        </testcase>
        <testcase classname="RealtimeClientPresenceTests" name="test__014__Presence__PresenceMap_has_existing_members_when_a_SYNC_is_started__should_emit_a_LEAVE_event_for_each_existing_member_if_the_PresenceMap_has_existing_members_when_an_ATTACHED_message_is_received_without_a_HAS_PRESENCE_flag()" time="0.7855319976806641">
        </testcase>
        <testcase classname="RealtimeClientPresenceTests" name="test__015__Presence__subscribe__with_no_arguments_should_subscribe_a_listener_to_all_presence_messages()" time="1.8427720069885254">
        </testcase>
        <testcase classname="RealtimeClientPresenceTests" name="test__016__Presence__unsubscribe__with_no_arguments_unsubscribes_the_listener_if_previously_subscribed_with_an_action_specific_subscription()" time="0.008927106857299805">
        </testcase>
        <testcase classname="RealtimeClientPresenceTests" name="test__017__Presence__Channel_state_change_side_effects__if_a_channel_enters_the_ATTACHED_state_then_all_queued_presence_messages_will_be_sent_immediately_and_a_presence_SYNC_may_be_initiated()" time="0.7962599992752075">
        </testcase>
        <testcase classname="RealtimeClientPresenceTests" name="test__018__Presence__Channel_state_change_side_effects__if_the_channel_enters_the_FAILED_state__all_queued_presence_messages_should_fail_immediately()" time="0.0030679702758789062">
        </testcase>
        <testcase classname="RealtimeClientPresenceTests" name="test__019__Presence__Channel_state_change_side_effects__if_the_channel_enters_the_FAILED_state__should_clear_the_PresenceMap_including_local_members_and_does_not_emit_any_presence_events()" time="0.41268301010131836">
        </testcase>
        <testcase classname="RealtimeClientPresenceTests" name="test__020__Presence__Channel_state_change_side_effects__if_the_channel_enters_the_DETACHED_state__all_queued_presence_messages_should_fail_immediately()" time="0.005041956901550293">
        </testcase>
        <testcase classname="RealtimeClientPresenceTests" name="test__021__Presence__Channel_state_change_side_effects__if_the_channel_enters_the_DETACHED_state__should_clear_the_PresenceMap_including_local_members_and_does_not_emit_any_presence_events()" time="0.5437349081039429">
        </testcase>
        <testcase classname="RealtimeClientPresenceTests" name="test__022__Presence__Channel_state_change_side_effects__channel_enters_the_SUSPENDED_state__all_queued_presence_messages_should_fail_immediately()" time="0.002547025680541992">
        </testcase>
        <testcase classname="RealtimeClientPresenceTests" name="test__023__Presence__Channel_state_change_side_effects__channel_enters_the_SUSPENDED_state__members_map_is_preserved_and_only_members_that_changed_between_ATTACHED_states_should_result_in_presence_events()" time="4.196844100952148">
        </testcase>
        <testcase classname="RealtimeClientPresenceTests" name="test__024__Presence__enter__should_enter_the_current_client__optionally_with_the_data_provided()" time="0.4833899736404419">
        </testcase>
        <testcase classname="RealtimeClientPresenceTests" name="test__025__Presence__unsubscribe__with_a_single_action_argument_unsubscribes_the_provided_listener_to_all_presence_messages_for_that_action()" time="0.004976987838745117">
        </testcase>
        <testcase classname="RealtimeClientPresenceTests" name="test__026__Presence__subscribe__should_implicitly_attach_the_channel_if_options_attachOnSubscribe_is_true()" time="0.6202349662780762">
        </testcase>
        <testcase classname="RealtimeClientPresenceTests" name="test__026b__Presence__subscribe__should_not_implicitly_attach_the_channel_if_options_attachOnSubscribe_is_false()" time="1.0597800016403198">
        </testcase>
        <testcase classname="RealtimeClientPresenceTests" name="test__027__Presence__subscribe__should_result_in_an_error_if_the_channel_is_in_the_FAILED_state_and_options_attachOnSubscribe_is_true()" time="0.0036220550537109375">
        </testcase>
        <testcase classname="RealtimeClientPresenceTests" name="test__027b__Presence__subscribe__should_not_result_in_an_error_if_the_channel_is_in_the_FAILED_state_and_options_attachOnSubscribe_is_false()" time="1.0573630332946777">
        </testcase>
        <testcase classname="RealtimeClientPresenceTests" name="test__028__Presence__subscribe__should_result_in_an_error_if_the_channel_moves_to_the_FAILED_state()" time="0.0025620460510253906">
        </testcase>
        <testcase classname="RealtimeClientPresenceTests" name="test__029__Presence__subscribe__with_a_single_action_argument()" time="1.4188460111618042">
        </testcase>
        <testcase classname="RealtimeClientPresenceTests" name="test__030__Presence__enter__optionally_a_callback_can_be_provided_that_is_called_for_success()" time="0.4645960330963135">
        </testcase>
        <testcase classname="RealtimeClientPresenceTests" name="test__031__Presence__enter__optionally_a_callback_can_be_provided_that_is_called_for_failure()" time="0.35558104515075684">
        </testcase>
        <testcase classname="RealtimeClientPresenceTests" name="test__032__Presence__enter__entering_without_an_explicit_PresenceMessage_clientId_should_implicitly_use_the_clientId_of_the_current_connection()" time="0.871925950050354">
        </testcase>
        <testcase classname="RealtimeClientPresenceTests" name="test__033__Presence__enter__should_result_in_an_error_immediately_if_the_connection_state_is_connected_and_the_client_is_anonymous()" time="0.25525403022766113">
        </testcase>
        <testcase classname="RealtimeClientPresenceTests" name="test__033__Presence__enter__should_result_in_an_error_immediately_if_the_connection_state_is_connected_and_the_client_is_wildcard()" time="0.2873469591140747">
        </testcase>
        <testcase classname="RealtimeClientPresenceTests" name="test__034__Presence__enter__should_result_in_an_error_immediately_if_the_channel_is_DETACHED()" time="0.38911592960357666">
        </testcase>
        <testcase classname="RealtimeClientPresenceTests" name="test__035__Presence__enter__should_result_in_an_error_immediately_if_the_channel_is_FAILED()" time="0.003430962562561035">
        </testcase>
        <testcase classname="RealtimeClientPresenceTests" name="test__036__Presence__enter__should_result_in_an_error_if_Ably_service_determines_that_the_client_is_unidentified()" time="0.39340198040008545">
        </testcase>
        <testcase classname="RealtimeClientPresenceTests" name="test__037__Presence__update__should_update_the_data_for_the_present_member_with_a_value()" time="0.5511609315872192">
        </testcase>
        <testcase classname="RealtimeClientPresenceTests" name="test__038__Presence__update__should_update_the_data_for_the_present_member_with_null()" time="0.462615966796875">
        </testcase>
        <testcase classname="RealtimeClientPresenceTests" name="test__039__Presence__update__should_enter_current_client_into_the_channel_if_the_client_was_not_already_entered()" time="0.40652501583099365">
        </testcase>
        <testcase classname="RealtimeClientPresenceTests" name="test__040__Presence__update__optionally_a_callback_can_be_provided_that_is_called_for_success()" time="0.39526498317718506">
        </testcase>
        <testcase classname="RealtimeClientPresenceTests" name="test__041__Presence__update__optionally_a_callback_can_be_provided_that_is_called_for_failure()" time="0.004415035247802734">
        </testcase>
        <testcase classname="RealtimeClientPresenceTests" name="test__042__Presence__update__update_without_an_explicit_PresenceMessage_clientId_should_implicitly_use_the_clientId_of_the_current_connection()" time="0.9129480123519897">
        </testcase>
        <testcase classname="RealtimeClientPresenceTests" name="test__043__Presence__leave__should_leave_the_current_client_from_the_channel_and_the_data_will_be_updated_with_the_value_provided()" time="0.4740290641784668">
        </testcase>
        <testcase classname="RealtimeClientPresenceTests" name="test__044__Presence__leave__should_leave_the_current_client_with_no_data()" time="0.4837440252304077">
        </testcase>
        <testcase classname="RealtimeClientPresenceTests" name="test__045__Presence__PresenceMap__all_incoming_presence_messages_must_be_compared_for_newness_with_the_matching_member_already_in_the_PresenceMap()" time="0.89519202709198">
        </testcase>
        <testcase classname="RealtimeClientPresenceTests" name="test__047__Presence__PresenceMap__if_action_of_UPDATE_arrives__it_should_be_added_to_the_presence_map_with_the_action_set_to_PRESENT()" time="0.8915649652481079">
        </testcase>
        <testcase classname="RealtimeClientPresenceTests" name="test__048__Presence__PresenceMap__if_action_of_PRESENT_arrives__it_should_be_added_to_the_presence_map_with_the_action_set_to_PRESENT()" time="0.7167710065841675">
        </testcase>
        <testcase classname="RealtimeClientPresenceTests" name="test__049__Presence__PresenceMap__if_a_SYNC_is_not_in_progress__then_when_a_presence_message_with_an_action_of_LEAVE_arrives__that_memberKey_should_be_deleted_from_the_presence_map__if_present()" time="10.315591931343079">
        </testcase>
        <testcase classname="RealtimeClientPresenceTests" name="test__050__Presence__PresenceMap__if_a_SYNC_is_in_progress__then_when_a_presence_message_with_an_action_of_LEAVE_arrives__it_should_be_stored_in_the_presence_map_with_the_action_set_to_ABSENT()" time="10.260473012924194">
        </testcase>
        <testcase classname="RealtimeClientPresenceTests" name="test__051__Presence__PresenceMap__any_incoming_presence_message_that_passes_the_newness_check_should_be_emitted_on_the_Presence_object__with_an_event_name_set_to_its_original_action()" time="0.39126789569854736">
        </testcase>
        <testcase classname="RealtimeClientPresenceTests" name="test__052__Presence__PresenceMap__compare_for_newness__split_the_id_of_both_presence_messages()" time="50.893356919288635">
        </testcase>
        <testcase classname="RealtimeClientPresenceTests" name="test__053__Presence__PresenceMap__compare_for_newness__presence_message_has_a_connectionId_which_is_not_an_initial_substring_of_its_id__compares_them_by_timestamp_numerically()" time="50.94919204711914">
        </testcase>
        <testcase classname="RealtimeClientPresenceTests" name="test__054__Presence__PresenceMap__all_presence_messages_from_a_SYNC_must_also_be_compared_for_newness_in_the_same_way_as_they_would_from_a_PRESENCE__discard_members_where_messages_have_arrived_before_the_SYNC()" time="10.276785016059875">
        </testcase>
        <testcase classname="RealtimeClientPresenceTests" name="test__056__Presence__enter__should_result_in_an_error_if_the_client_does_not_have_required_presence_permission()" time="0.5177899599075317">
        </testcase>
        <testcase classname="RealtimeClientPresenceTests" name="test__057__Presence__update__should_result_in_an_error_immediately_if_the_client_is_anonymous()" time="0.39457499980926514">
        </testcase>
        <testcase classname="RealtimeClientPresenceTests" name="test__058__Presence__update__should_result_in_an_error_immediately_if_the_channel_is_DETACHED()" time="0.40462398529052734">
        </testcase>
        <testcase classname="RealtimeClientPresenceTests" name="test__059__Presence__update__should_result_in_an_error_immediately_if_the_channel_is_FAILED()" time="0.0035480260848999023">
        </testcase>
        <testcase classname="RealtimeClientPresenceTests" name="test__060__Presence__update__should_result_in_an_error_if_the_client_does_not_have_required_presence_permission()" time="0.48232901096343994">
        </testcase>
        <testcase classname="RealtimeClientPresenceTests" name="test__061__Presence__update__should_result_in_an_error_if_Ably_service_determines_that_the_client_is_unidentified()" time="0.4171719551086426">
        </testcase>
        <testcase classname="RealtimeClientPresenceTests" name="test__062__Presence__leave__optionally_a_callback_can_be_provided_that_is_called_for_success()" time="0.9031310081481934">
        </testcase>
        <testcase classname="RealtimeClientPresenceTests" name="test__063__Presence__leave__optionally_a_callback_can_be_provided_that_is_called_for_failure()" time="0.4660419225692749">
        </testcase>
        <testcase classname="RealtimeClientPresenceTests" name="test__064__Presence__leave__should_raise_an_error_if_client_is_not_present()" time="0.3921319246292114">
        </testcase>
        <testcase classname="RealtimeClientPresenceTests" name="test__065__Presence__leave__entering_without_an_explicit_PresenceMessage_clientId_should_implicitly_use_the_clientId_of_the_current_connection()" time="0.904228925704956">
        </testcase>
        <testcase classname="RealtimeClientPresenceTests" name="test__066__Presence__leave__if_the_client_is_not_currently_ENTERED__Ably_will_respond_with_an_ACK_and_the_request_will_succeed()" time="1.8918789625167847">
        </testcase>
        <testcase classname="RealtimeClientPresenceTests" name="test__067__Presence__enter__implicitly_attaches_the_Channel()" time="0.39684104919433594">
        </testcase>
        <testcase classname="RealtimeClientPresenceTests" name="test__068__Presence__enter__should_result_in_an_error_if_the_channel_is_in_the_FAILED_state()" time="0.003854036331176758">
        </testcase>
        <testcase classname="RealtimeClientPresenceTests" name="test__069__Presence__enter__should_result_in_an_error_if_the_channel_is_in_the_DETACHED_state()" time="0.3844320774078369">
        </testcase>
        <testcase classname="RealtimeClientPresenceTests" name="test__070__Presence__leave__should_result_in_an_error_immediately_if_the_client_is_anonymous()" time="0.384895920753479">
        </testcase>
        <testcase classname="RealtimeClientPresenceTests" name="test__071__Presence__leave__should_result_in_an_error_immediately_if_the_channel_is_DETACHED()" time="0.4023270606994629">
        </testcase>
        <testcase classname="RealtimeClientPresenceTests" name="test__072__Presence__leave__should_result_in_an_error_immediately_if_the_channel_is_FAILED()" time="0.4056839942932129">
        </testcase>
        <testcase classname="RealtimeClientPresenceTests" name="test__073__Presence__leave__should_result_in_an_error_if_the_client_does_not_have_required_presence_permission()" time="0.49429500102996826">
        </testcase>
        <testcase classname="RealtimeClientPresenceTests" name="test__074__Presence__leave__should_result_in_an_error_if_Ably_service_determines_that_the_client_is_unidentified()" time="0.42055702209472656">
        </testcase>
        <testcase classname="RealtimeClientPresenceTests" name="test__078__Presence__enter__optional_data_can_be_included_when_entering_a_channel()" time="0.8212659358978271">
        </testcase>
        <testcase classname="RealtimeClientPresenceTests" name="test__079__Presence__enter__should_emit_the_data_attribute_in_the_LEAVE_event_when_data_is_provided_when_entering_but_no_data_is_provided_when_leaving()" time="0.898597002029419">
        </testcase>
        <testcase classname="RealtimeClientPresenceTests" name="test__080__Presence__private_and_internal_PresenceMap_containing_only_members_that_match_the_current_connectionId__any_ENTER__PRESENT__UPDATE_or_LEAVE_event_that_matches_the_current_connectionId_should_be_applied_to_this_object()" time="0.6121180057525635">
        </testcase>
        <testcase classname="RealtimeClientPresenceTests" name="test__081__Presence__private_and_internal_PresenceMap_containing_only_members_that_match_the_current_connectionId__all_members_belonging_to_the_current_connection_are_published_as_a_PresenceMessage_on_the_Channel_by_the_server_irrespective_of_whether_the_client_has_permission_to_subscribe_or_the_Channel_is_configured_to_publish_presence_events()" time="0.5800909996032715">
        </testcase>
        <testcase classname="RealtimeClientPresenceTests" name="test__084__Presence__enterClient__should_implicitly_attach_the_Channel()" time="0.43214595317840576">
        </testcase>
        <testcase classname="RealtimeClientPresenceTests" name="test__085__Presence__enterClient__should_result_in_an_error_if_the_channel_is_in_the_FAILED_state()" time="0.0030421018600463867">
        </testcase>
        <testcase classname="RealtimeClientPresenceTests" name="test__086__Presence__enterClient__should_result_in_an_error_if_the_channel_moves_to_the_FAILED_state()" time="0.004055976867675781">
        </testcase>
        <testcase classname="RealtimeClientPresenceTests" name="test__087__Presence__updateClient__should_implicitly_attach_the_Channel()" time="0.43598997592926025">
        </testcase>
        <testcase classname="RealtimeClientPresenceTests" name="test__088__Presence__updateClient__should_result_in_an_error_if_the_channel_is_in_the_FAILED_state()" time="0.004651904106140137">
        </testcase>
        <testcase classname="RealtimeClientPresenceTests" name="test__089__Presence__updateClient__should_result_in_an_error_if_the_channel_moves_to_the_FAILED_state()" time="0.0048389434814453125">
        </testcase>
        <testcase classname="RealtimeClientPresenceTests" name="test__090__Presence__leaveClient__should_implicitly_attach_the_Channel()" time="0.3979029655456543">
        </testcase>
        <testcase classname="RealtimeClientPresenceTests" name="test__091__Presence__leaveClient__should_result_in_an_error_if_the_channel_is_in_the_FAILED_state()" time="0.004119992256164551">
        </testcase>
        <testcase classname="RealtimeClientPresenceTests" name="test__092__Presence__leaveClient__should_result_in_an_error_if_the_channel_moves_to_the_FAILED_state()" time="0.011164069175720215">
        </testcase>
        <testcase classname="RealtimeClientPresenceTests" name="test__093__Presence__Connection_state_conditions__all_presence_messages_are_published_immediately_if_the_connection_is_CONNECTED()" time="0.39732491970062256">
        </testcase>
        <testcase classname="RealtimeClientPresenceTests" name="test__094__Presence__Connection_state_conditions__all_presence_messages_will_be_queued_and_delivered_as_soon_as_the_connection_state_returns_to_CONNECTED()" time="0.7793740034103394">
        </testcase>
        <testcase classname="RealtimeClientPresenceTests" name="test__095__Presence__Connection_state_conditions__all_presence_messages_will_be_lost_if_queueMessages_has_been_explicitly_set_to_false()" time="0.32785701751708984">
        </testcase>
        <testcase classname="RealtimeClientPresenceTests" name="test__096__Presence__Connection_state_conditions__should_result_in_an_error_if_the_connection_state_is_INITIALIZED_and_queueMessages_has_been_explicitly_set_to_false()" time="0.0024940967559814453">
        </testcase>
        <testcase classname="RealtimeClientPresenceTests" name="test__097__Presence__Connection_state_conditions__should_result_in_an_error_if_the_connection_state_is__suspended()" time="0.32165491580963135">
        </testcase>
        <testcase classname="RealtimeClientPresenceTests" name="test__098__Presence__Connection_state_conditions__should_result_in_an_error_if_the_connection_state_is__closed()" time="0.3969930410385132">
        </testcase>
        <testcase classname="RealtimeClientPresenceTests" name="test__099__Presence__Connection_state_conditions__should_result_in_an_error_if_the_connection_state_is__failed()" time="0.33539700508117676">
        </testcase>
        <testcase classname="RealtimeClientPresenceTests" name="test__100__Presence__get__should_return_a_list_of_current_members_on_the_channel()" time="75.41989696025848">
        </testcase>
        <testcase classname="RealtimeClientPresenceTests" name="test__101__Presence__get__should_implicitly_attach_the_channel()" time="0.40199100971221924">
        </testcase>
        <testcase classname="RealtimeClientPresenceTests" name="test__102__Presence__get__should_result_in_an_error_if_the_channel_is_in_the_FAILED_state()" time="0.003345012664794922">
        </testcase>
        <testcase classname="RealtimeClientPresenceTests" name="test__103__Presence__get__should_result_in_an_error_if_the_channel_moves_to_the_FAILED_state()" time="0.003461003303527832">
        </testcase>
        <testcase classname="RealtimeClientPresenceTests" name="test__104__Presence__get__should_result_in_an_error_if_the_channel_is_in_the_DETACHED_state()" time="0.4254169464111328">
        </testcase>
        <testcase classname="RealtimeClientPresenceTests" name="test__105__Presence__get__should_result_in_an_error_if_the_channel_moves_to_the_DETACHED_state()" time="60.088114976882935">
        </testcase>
        <testcase classname="RealtimeClientPresenceTests" name="test__106__Presence__get__query__waitForSync_should_be_true_by_default()" time="0.0020270347595214844">
        </testcase>
        <testcase classname="RealtimeClientPresenceTests" name="test__107__Presence__get__If_the_Channel_is_in_the_SUSPENDED_state_then__by_default__results_in_an_error()" time="0.008533954620361328">
        </testcase>
        <testcase classname="RealtimeClientPresenceTests" name="test__108__Presence__get__If_the_Channel_is_in_the_SUSPENDED_state_then__if_waitForSync_is_true__results_in_an_error()" time="0.004604935646057129">
        </testcase>
        <testcase classname="RealtimeClientPresenceTests" name="test__109__Presence__get__If_the_Channel_is_in_the_SUSPENDED_state_then__if_waitForSync_is_false__returns_the_members_in_the_current_PresenceMap()" time="0.003113985061645508">
        </testcase>
        <testcase classname="RealtimeClientPresenceTests" name="test__110__Presence__get__Query__set_of_params___waitForSync_is_true__should_wait_until_SYNC_is_complete_before_returning_a_list_of_members()" time="75.52529394626617">
        </testcase>
        <testcase classname="RealtimeClientPresenceTests" name="test__111__Presence__get__Query__set_of_params___waitForSync_is_false__should_return_immediately_the_known_set_of_presence_members()" time="75.38865804672241">
        </testcase>
        <testcase classname="RealtimeClientPresenceTests" name="test__112__Presence__get__Query__set_of_params___should_return_members_filtered_by_clientId()" time="0.4175069332122803">
        </testcase>
        <testcase classname="RealtimeClientPresenceTests" name="test__113__Presence__get__Query__set_of_params___should_return_members_filtered_by_connectionId()" time="50.86936402320862">
        </testcase>
        <testcase classname="RealtimeClientPresenceTests" name="test__114__Presence__history__should_support_all_the_same_params_as_Rest()" time="0.44511592388153076">
        </testcase>
        <testcase classname="RealtimeClientPresenceTests" name="test__115__Presence__history__should_return_a_PaginatedResult_page()" time="75.30509090423584">
        </testcase>
        <testcase classname="RealtimeClientPresenceTests" name="test__116__Presence__enterClient__enters_into_presence_on_a_channel_on_behalf_of_another_clientId()" time="0.4828699827194214">
        </testcase>
        <testcase classname="RealtimeClientPresenceTests" name="test__117__Presence__enterClient__should_be_present_all_the_registered_members_on_a_presence_channel()" time="0.9398219585418701">
        </testcase>
        <testcase classname="RealtimeClientPresenceTests" name="test__118__Presence__presence_message_attributes__if_the_presence_message_does_not_contain_an_id__it_should_be_set_to_protocolMsgId_index()" time="0.2570270299911499">
        </testcase>
        <testcase classname="RealtimeClientPresenceTests" name="test__119__Presence__presence_message_attributes__extras_should_be_populated_from_user_claims_in_JWT()" time="0.9457969665527344">
        </testcase>
        <testcase classname="RealtimeClientPresenceTests" name="test__200__Presence__PresenceMap_should_perform_re_entry_whenever_a_channel_moves_into_the_attached_state_and_presence_message_consists_of_enter_action_with_client_id_and_data()" time="1.3664929866790771">
        </testcase>
        <testcase classname="RealtimeClientPresenceTests" name="test__201__Presence__history__untilAttach_on_a_channel_that_is_not_attached_should_call_back_with_an_error()" time="0.00262606143951416">
        </testcase>
        <testcase classname="RealtimeClientTests" name="test__001__RealtimeClient__All_WebSocket_connections_should_include_the_current_API_version()" time="0.3305410146713257">
        </testcase>
        <testcase classname="RealtimeClientTests" name="test__002__RealtimeClient__should_have_access_to_the_underlying_Connection_object()" time="0.00775301456451416">
        </testcase>
        <testcase classname="RealtimeClientTests" name="test__003__RealtimeClient__should_provide_access_to_the_underlying_Channels_object()" time="0.0019109249114990234">
        </testcase>
        <testcase classname="RealtimeClientTests" name="test__004__RealtimeClient__should_use_the_configured_timeouts_specified()" time="6.612807989120483">
        </testcase>
        <testcase classname="RealtimeClientTests" name="test__005__RealtimeClient__background_behaviour()" time="0.8603720664978027">
        </testcase>
        <testcase classname="RealtimeClientTests" name="test__006__RealtimeClient__should_accept_acks_with_different_order()" time="0.9502129554748535">
        </testcase>
        <testcase classname="RealtimeClientTests" name="test__007__RealtimeClient__transport_should_guarantee_the_incoming_message_order()" time="0.2667419910430908">
        </testcase>
        <testcase classname="RealtimeClientTests" name="test__008__RealtimeClient__subscriber_should_receive_messages_in_the_same_order_in_which_they_have_been_sent()" time="0.4562070369720459">
        </testcase>
        <testcase classname="RealtimeClientTests" name="test__009__RealtimeClient__should_dispatch_in_user_queue_when_removing_an_observer()" time="0.005218982696533203">
        </testcase>
        <testcase classname="RealtimeClientTests" name="test__010__RealtimeClient__should_never_register_any_connection_listeners_for_internal_use_with_the_public_EventEmitter()" time="0.324052095413208">
        </testcase>
        <testcase classname="RealtimeClientTests" name="test__011__RealtimeClient__should_never_register_any_message_and_channel_listeners_for_internal_use_with_the_public_EventEmitter()" time="0.7126489877700806">
        </testcase>
        <testcase classname="RealtimeClientTests" name="test__012__RealtimeClient__moves_to_DISCONNECTED_on_an_unexpected_normal_WebSocket_close()" time="0.8230750560760498">
        </testcase>
        <testcase classname="RealtimeClientTests" name="test__013__RealtimeClient__options__should_support_the_same_options_as_the_Rest_client()" time="0.25032103061676025">
        </testcase>
        <testcase classname="RealtimeClientTests" name="test__014__RealtimeClient__options__should_echoMessages_option_be_true_by_default()" time="0.0005679130554199219">
        </testcase>
        <testcase classname="RealtimeClientTests" name="test__015__RealtimeClient__options__should_autoConnect_option_be_true_by_default()" time="0.00047910213470458984">
        </testcase>
        <testcase classname="RealtimeClientTests" name="test__016__RealtimeClient__options__should_attempt_to_recover_the_connection_state_if_recover_string_is_assigned()" time="0.5118100643157959">
        </testcase>
        <testcase classname="RealtimeClientTests" name="test__017__RealtimeClient__options__should_connect_to_the_endpoint_if_it_is_a_hostname()" time="0.016133904457092285">
        </testcase>
        <testcase classname="RealtimeClientTests" name="test__018__RealtimeClient__options__should_modify_both_the_REST_and_realtime_host_if_endpoint_is_assigned()" time="0.0006879568099975586">
        </testcase>
        <testcase classname="RealtimeClientTests" name="test__019__RealtimeClient__options__url_should_contains_transport_params()" time="0.0038900375366210938">
        </testcase>
        <testcase classname="RealtimeClientTests" name="test__020__RealtimeClient__Auth_object__should_provide_access_to_the_Auth_object()" time="0.002496957778930664">
        </testcase>
        <testcase classname="RealtimeClientTests" name="test__021__RealtimeClient__Auth_object__clientId_may_be_populated_when_the_connection_is_established()" time="0.2678670883178711">
        </testcase>
        <testcase classname="RealtimeClientTests" name="test__022__RealtimeClient__stats__should_present_an_async_interface()" time="0.23582303524017334">
        </testcase>
        <testcase classname="RealtimeClientTests" name="test__023__RealtimeClient__stats__should_accept_all_the_same_params_as_RestClient()" time="0.6415940523147583">
        </testcase>
        <testcase classname="RealtimeClientTests" name="test__024__RealtimeClient__time__should_present_an_async_interface()" time="0.164620041847229">
        </testcase>
        <testcase classname="RealtimeClientTests" name="test__025__RealtimeClient__Auth_authorize_should_upgrade_the_connection_with_current_token__in_the_CONNECTED_state_and_auth_authorize_is_called__the_client_must_obtain_a_new_token__send_an_AUTH_ProtocolMessage_with_an_auth_attribute()" time="0.5621590614318848">
        </testcase>
        <testcase classname="RealtimeClientTests" name="test__026__RealtimeClient__Auth_authorize_should_upgrade_the_connection_with_current_token__when_the_authentication_token_change_is_successful__then_the_client_should_receive_a_new_CONNECTED_ProtocolMessage()" time="0.6497809886932373">
        </testcase>
        <testcase classname="RealtimeClientTests" name="test__027__RealtimeClient__Auth_authorize_should_upgrade_the_connection_with_current_token__performs_an_upgrade_of_capabilities_without_any_loss_of_continuity_or_connectivity_during_the_upgrade_process()" time="0.7776650190353394">
        </testcase>
        <testcase classname="RealtimeClientTests" name="test__028__RealtimeClient__Auth_authorize_should_upgrade_the_connection_with_current_token__when_capabilities_are_downgraded__client_should_receive_an_ERROR_ProtocolMessage_with_a_channel_property()" time="0.7114779949188232">
        </testcase>
        <testcase classname="RealtimeClientTests" name="test__029__RealtimeClient__Auth_authorize_should_upgrade_the_connection_with_current_token__when_the_authentication_token_change_fails__client_should_receive_an_ERROR_ProtocolMessage_triggering_the_connection_to_transition_to_the_FAILED_state()" time="0.49181509017944336">
        </testcase>
        <testcase classname="RealtimeClientTests" name="test__030__RealtimeClient__Auth_authorize_should_upgrade_the_connection_with_current_token__authorize_call_should_complete_with_an_error_if_the_request_fails()" time="0.4086329936981201">
        </testcase>
        <testcase classname="RealtimeClientTests" name="test__031__RealtimeClient__Auth_authorize_should_upgrade_the_connection_with_current_token__authorize_call_should_be_indicated_as_completed_with_the_new_token_or_error_only_once_realtime_has_responded_to_the_AUTH_with_either_a_CONNECTED_or_ERROR_respectively()" time="0.5624459981918335">
        </testcase>
        <testcase classname="RealtimeClientTests" name="test__032__RealtimeClient__Auth_authorize_should_upgrade_the_connection_with_current_token__when_connection_is_CONNECTING__all_current_connection_attempts_should_be_halted__and_after_obtaining_a_new_token_the_library_should_immediately_initiate_a_connection_attempt_using_the_new_token()" time="0.6696089506149292">
        </testcase>
        <testcase classname="RealtimeClientTests" name="test__033__RealtimeClient__Auth_authorize_should_upgrade_the_connection_with_current_token__authorize_call_should_complete_with_the_new_token_once_the_connection_has_moved_to_the_CONNECTED_state()" time="0.5753120183944702">
        </testcase>
        <testcase classname="RealtimeClientTests" name="test__034__RealtimeClient__Auth_authorize_should_upgrade_the_connection_with_current_token__authorize_call_should_complete_with_an_error_if_the_connection_moves_to_the_FAILED_state()" time="0.4139939546585083">
        </testcase>
        <testcase classname="RealtimeClientTests" name="test__035__RealtimeClient__Auth_authorize_should_upgrade_the_connection_with_current_token__authorize_call_should_complete_with_an_error_if_the_connection_moves_to_the_SUSPENDED_state()" time="0.4238150119781494">
        </testcase>
        <testcase classname="RealtimeClientTests" name="test__036__RealtimeClient__Auth_authorize_should_upgrade_the_connection_with_current_token__authorize_call_should_complete_with_an_error_if_the_connection_moves_to_the_CLOSED_state()" time="0.4733179807662964">
        </testcase>
        <testcase classname="RealtimeClientTests" name="test__037__RealtimeClient__Auth_authorize_should_upgrade_the_connection_with_current_token__when_the_connection_is_in_the_SUSPENDED_state_when_auth_authorize_is_called__after_obtaining_a_token_the_library_should_move_to_the_CONNECTING_state_and_initiate_a_connection_attempt_using_the_new_token()" time="0.829658031463623">
        </testcase>
        <testcase classname="RealtimeClientTests" name="test__038__RealtimeClient__Auth_authorize_should_upgrade_the_connection_with_current_token__when_the_connection_is_in_the_CLOSED_state_when_auth_authorize_is_called__after_obtaining_a_token_the_library_should_move_to_the_CONNECTING_state_and_initiate_a_connection_attempt_using_the_new_token()" time="0.9152449369430542">
        </testcase>
        <testcase classname="RealtimeClientTests" name="test__039__RealtimeClient__Auth_authorize_should_upgrade_the_connection_with_current_token__when_the_connection_is_in_the_DISCONNECTED_state_when_auth_authorize_is_called__after_obtaining_a_token_the_library_should_move_to_the_CONNECTING_state_and_initiate_a_connection_attempt_using_the_new_token()" time="1.0144169330596924">
        </testcase>
        <testcase classname="RealtimeClientTests" name="test__040__RealtimeClient__Auth_authorize_should_upgrade_the_connection_with_current_token__when_the_connection_is_in_the_FAILED_state_when_auth_authorize_is_called__after_obtaining_a_token_the_library_should_move_to_the_CONNECTING_state_and_initiate_a_connection_attempt_using_the_new_token()" time="1.1880680322647095">
        </testcase>
        <testcase classname="RealtimeClientTests" name="test__041__If_the_total_size_of_message_s__exceeds_the_maxMessageSize__the_client_library_should_reject_the_publish_and_indicate_an_error()" time="0.31856203079223633">
        </testcase>
        <testcase classname="RealtimeClientTests" name="test__042__If_the_total_size_of_message_s__exceeds_the_maxMessageSize__the_client_library_should_reject_also_presence_messages__enter_()" time="0.2568690776824951">
        </testcase>
        <testcase classname="RealtimeClientTests" name="test__043__If_the_total_size_of_message_s__exceeds_the_maxMessageSize__the_client_library_should_reject_also_presence_messages__leave_()" time="0.25395500659942627">
        </testcase>
        <testcase classname="RealtimeClientTests" name="test__044__If_the_total_size_of_message_s__exceeds_the_maxMessageSize__the_client_library_should_reject_also_presence_messages__update_()" time="0.25598299503326416">
        </testcase>
        <testcase classname="RealtimeClientTests" name="test__045__If_the_total_size_of_message_s__exceeds_the_maxMessageSize__the_client_library_should_reject_also_presence_messages__updateClient_()" time="0.25108301639556885">
        </testcase>
        <testcase classname="RealtimeClientTests" name="test__046__If_the_total_size_of_message_s__exceeds_the_maxMessageSize__the_client_library_should_reject_also_presence_messages__leaveClient_()" time="0.25468599796295166">
        </testcase>
        <testcase classname="RealtimeClientTests" name="test_clientId()" time="0.41341400146484375">
        </testcase>
        <testcase classname="RetrySequenceTests" name="test_addRetryAttempt()" time="0.0005869865417480469">
        </testcase>
        <testcase classname="StatsTests" name="test__Stats__appId__is_decoded()" time="0.004804015159606934">
        </testcase>
        <testcase classname="StatsTests" name="test__Stats__entries__are_decoded()" time="0.0008549690246582031">
        </testcase>
        <testcase classname="StatsTests" name="test__Stats__entries__are_empty_when_absent()" time="0.0006159543991088867">
        </testcase>
        <testcase classname="StatsTests" name="test__Stats__entries__keep_only_numeric_values()" time="0.00046896934509277344">
        </testcase>
        <testcase classname="StatsTests" name="test__Stats__inProgress__is_decoded()" time="0.0015799999237060547">
        </testcase>
        <testcase classname="StatsTests" name="test__Stats__inProgress__is_nil_when_absent()" time="0.0016200542449951172">
        </testcase>
        <testcase classname="StatsTests" name="test__Stats__intervalId__is_decoded()" time="0.0012520551681518555">
        </testcase>
        <testcase classname="StatsTests" name="test__Stats__intervalTime__is_the_start_of_the_interval()" time="0.005823016166687012">
        </testcase>
        <testcase classname="StatsTests" name="test__Stats__schema__is_decoded()" time="0.0006450414657592773">
        </testcase>
        <testcase classname="StatsTests" name="test__Stats__unit__is_decoded_from_the_unit_property()" time="0.0006699562072753906">
        </testcase>
        <testcase classname="StringifiableTests" name="test__001__Stringifiable__type_conversion__as_string()" time="0.0016859769821166992">
        </testcase>
        <testcase classname="StringifiableTests" name="test__002__Stringifiable__type_conversion__as_bool__true_()" time="0.0005099773406982422">
        </testcase>
        <testcase classname="StringifiableTests" name="test__003__Stringifiable__type_conversion__as_bool__false_()" time="0.0005639791488647461">
        </testcase>
        <testcase classname="StringifiableTests" name="test__004__Stringifiable__type_conversion__as_integer_that_is_not_treated_as_bool__false_()" time="0.0006639957427978516">
        </testcase>
        <testcase classname="StringifiableTests" name="test__005__Stringifiable__type_conversion__as_integer_that_is_not_treated_as_bool__true_()" time="0.0005109310150146484">
        </testcase>
        <testcase classname="StringifiableTests" name="test__006__Stringifiable__type_conversion__as_number__Int_()" time="0.0005670785903930664">
        </testcase>
        <testcase classname="StringifiableTests" name="test__007__Stringifiable__type_conversion__as_number__Float_1_decimal_digit_()" time="0.0005970001220703125">
        </testcase>
        <testcase classname="StringifiableTests" name="test__008__Stringifiable__type_conversion__as_number__Float_2_decimal_digits_()" time="0.0006579160690307617">
        </testcase>
        <testcase classname="StringifiableTests" name="test__009__Stringifiable__type_conversion__as_number__Float_4_decimal_digits_()" time="0.0004210472106933594">
        </testcase>
        <testcase classname="SummaryTypesTests" name="test__summaryDistinctV1__parses_dictionary_of_summaries()" time="0.013457894325256348">
        </testcase>
        <testcase classname="SummaryTypesTests" name="test__summaryFlagV1__parses_from_dictionary()" time="0.0014969110488891602">
        </testcase>
        <testcase classname="SummaryTypesTests" name="test__summaryFlagV1__returns_nil_for_invalid_dictionary()" time="0.001114964485168457">
        </testcase>
        <testcase classname="SummaryTypesTests" name="test__summaryFlagV1__with_clipped_property()" time="0.0007159709930419922">
        </testcase>
        <testcase classname="SummaryTypesTests" name="test__summaryMultipleV1__parses_dictionary_of_summaries()" time="0.024450063705444336">
        </testcase>
        <testcase classname="SummaryTypesTests" name="test__summaryMultipleV1__returns_nil_for_invalid_values()" time="0.0011680126190185547">
        </testcase>
        <testcase classname="SummaryTypesTests" name="test__summaryTotalV1__parses_from_dictionary()" time="0.0036870241165161133">
        </testcase>
        <testcase classname="SummaryTypesTests" name="test__summaryTotalV1__parses_string_number_from_dictionary()" time="0.0017609596252441406">
        </testcase>
        <testcase classname="SummaryTypesTests" name="test__summaryUniqueV1__parses_dictionary_of_summaries()" time="0.0013490915298461914">
        </testcase>
        <testcase classname="SystemTimeProviderTests" name="test_continuousClock_addingDuration()" time="0.5126280784606934">
        </testcase>
        <testcase classname="SystemTimeProviderTests" name="test_continuousClock_isAfter()" time="0.2575559616088867">
        </testcase>
        <testcase classname="SystemTimeProviderTests" name="test_schedule_derefsBlockAfterInvoke()" time="0.0011010169982910156">
        </testcase>
        <testcase classname="UtilitiesTests" name="test__001__Utilities__JSON_Encoder__should_decode_a_protocol_message_that_has_an_error_without_a_message()" time="0.001891016960144043">
        </testcase>
        <testcase classname="UtilitiesTests" name="test__002__Utilities__JSON_Encoder__should_encode_a_protocol_message_that_has_invalid_data()" time="0.025069117546081543">
        </testcase>
        <testcase classname="UtilitiesTests" name="test__003__Utilities__JSON_Encoder__should_decode_data_with_malformed_JSON()" time="0.0020149946212768555">
        </testcase>
        <testcase classname="UtilitiesTests" name="test__004__Utilities__JSON_Encoder__should_decode_data_with_malformed_MsgPack()" time="0.011178970336914062">
        </testcase>
        <testcase classname="UtilitiesTests" name="test__005__Utilities__JSON_Encoder__in_Realtime__should_handle_and_emit_the_invalid_data_error()" time="0.005435943603515625">
        </testcase>
        <testcase classname="UtilitiesTests" name="test__006__Utilities__JSON_Encoder__in_Realtime__should_ignore_invalid_transport_message()" time="0.3217819929122925">
        </testcase>
        <testcase classname="UtilitiesTests" name="test__007__Utilities__JSON_Encoder__in_Rest__should_handle_and_emit_the_invalid_data_error()" time="0.0034439563751220703">
        </testcase>
        <testcase classname="UtilitiesTests" name="test__008__Utilities__JSON_Encoder__in_Rest__should_ignore_invalid_response_payload()" time="0.003932952880859375">
        </testcase>
        <testcase classname="UtilitiesTests" name="test__009__Utilities__EventEmitter__should_emit_events_to_all_relevant_listeners()" time="0.00273895263671875">
        </testcase>
        <testcase classname="UtilitiesTests" name="test__010__Utilities__EventEmitter__should_only_call_once_listeners_once_for_its_event()" time="0.0017540454864501953">
        </testcase>
        <testcase classname="UtilitiesTests" name="test__011__Utilities__EventEmitter__calling_off_with_a_single_listener_argument__should_stop_receiving_events_when_calling_off_with_a_single_listener_argument()" time="0.0016689300537109375">
        </testcase>
        <testcase classname="UtilitiesTests" name="test__012__Utilities__EventEmitter__calling_off_with_a_single_listener_argument__should_remove_the_timeout()" time="0.3082979917526245">
        </testcase>
        <testcase classname="UtilitiesTests" name="test__013__Utilities__EventEmitter__calling_off_with_listener_and_event_arguments__should_still_receive_events_if_off_doesn_t_match_the_listener_s_criteria()" time="0.0014530420303344727">
        </testcase>
        <testcase classname="UtilitiesTests" name="test__014__Utilities__EventEmitter__calling_off_with_listener_and_event_arguments__should_stop_receive_events_if_off_matches_the_listener_s_criteria()" time="0.001598954200744629">
        </testcase>
        <testcase classname="UtilitiesTests" name="test__015__Utilities__EventEmitter__calling_off_with_no_arguments__should_remove_all_listeners()" time="0.0015228986740112305">
        </testcase>
        <testcase classname="UtilitiesTests" name="test__016__Utilities__EventEmitter__calling_off_with_no_arguments__should_allow_listening_again()" time="0.0015859603881835938">
        </testcase>
        <testcase classname="UtilitiesTests" name="test__017__Utilities__EventEmitter__calling_off_with_no_arguments__should_remove_all_timeouts()" time="0.1589059829711914">
        </testcase>
        <testcase classname="UtilitiesTests" name="test__018__Utilities__EventEmitter__the_timed_method__should_not_call_onTimeout_if_the_deadline_isn_t_reached()" time="0.3171980381011963">
        </testcase>
        <testcase classname="UtilitiesTests" name="test__019__Utilities__EventEmitter__the_timed_method__should_call_onTimeout_and_off_the_listener_if_the_deadline_is_reached()" time="0.3661400079727173">
        </testcase>
        <testcase classname="UtilitiesTests" name="test__020__Utilities__EventEmitter__set_of_listeners__should_not_change_over_the_course_of_the_emit()" time="0.0014809370040893555">
        </testcase>
        <testcase classname="UtilitiesTests" name="test__021__Utilities__Logger__should_have_a_history_of_logs()" time="0.336156964302063">
        </testcase>
        <testcase classname="UtilitiesTests" name="test__022__Utilities__maxMessageSize__calculates_maxMessageSize_of_a_Message_with_name_and_data()" time="0.0010840892791748047">
        </testcase>
        <testcase classname="UtilitiesTests" name="test__023__Utilities__maxMessageSize__calculates_maxMessageSize_of_a_Message_with_name__data_and_extras()" time="0.0024809837341308594">
        </testcase>
        <testcase classname="UtilitiesTests" name="test__024__Utilities__maxMessageSize__calculates_maxMessageSize_of_a_Message_with_name__data__clientId_and_extras()" time="0.0014899969100952148">
        </testcase>
        <testcase classname="UtilitiesTests" name="test__025_Utilities__message_should_populate_serial_timestamp_to_version()" time="0.0014530420303344727">
        </testcase>
        <testcase classname="UtilitiesTests" name="test__026_Utilities__message_should_always_populate_annotations_and_summary_when_decoding()" time="0.004060029983520508">
        </testcase>
        <testcase classname="UtilitiesTests" name="test__027__Utilities__maxMessageSize__measures_unicode_fields_per_documented_accounting()" time="0.0005700588226318359">
        </testcase>
        <testcase classname="UtilitiesTests" name="test__027_Utilities__message_received_with_new_version_structure()" time="0.004230976104736328">
        </testcase>
        <testcase classname="UtilitiesTests" name="test__028_Utilities__message_encoding_with_version_and_annotations()" time="0.002463102340698242">
        </testcase>
        <testcase classname="UtilitiesTests" name="test__029_Utilities__message_summary_that_is_not_an_object_decodes_as_empty()" time="0.002523064613342285">
        </testcase>
        <testcase classname="UtilitiesTests" name="test__030_Utilities__message_version_metadata_keeps_only_string_values()" time="0.0015540122985839844">
        </testcase>
        <testcase classname="UtilitiesTests" name="test__031_Utilities__extras_that_are_not_an_object_decode_as_nil()" time="0.000655055046081543">
        </testcase>
        <testcase classname="UtilitiesTests" name="test__Utilities__JSON_Encoder__should_decode_rest_error_response_with_complete_error_info()" time="0.0058029890060424805">
        </testcase>
        <testcase classname="UtilitiesTests" name="test__Utilities__JSON_Encoder__should_decode_rest_error_response_with_only_error_field()" time="0.0022150278091430664">
        </testcase>
        <testcase classname="WrapperSDKProxyTests" name="test_addsAgentChannelParam_whenFetchedWithChannelOptions()" time="0.32628393173217773">
        </testcase>
        <testcase classname="WrapperSDKProxyTests" name="test_addsAgentChannelParam_whenFetchedWithNoChannelOptions()" time="0.3641899824142456">
        </testcase>
        <testcase classname="WrapperSDKProxyTests" name="test_doesNotAddAgentParam_whenProxyClientCreatedWithoutAgents()" time="0.3216749429702759">
        </testcase>
        <testcase classname="WrapperSDKProxyTests" name="test_history_addsWrapperSDKAgentToRequest()" time="1.2235169410705566">
        </testcase>
        <testcase classname="WrapperSDKProxyTests" name="test_presenceHistory_addsWrapperSDKAgentToRequest()" time="0.25813305377960205">
        </testcase>
        <testcase classname="WrapperSDKProxyTests" name="test_pushAdmin_addsWrapperSDKAgentToRequests()" time="0.16443705558776855">
        </testcase>
        <testcase classname="WrapperSDKProxyTests" name="test_pushAdmin_channelSubscriptions_addsWrapperSDKAgentToRequests()" time="0.16477906703948975">
        </testcase>
        <testcase classname="WrapperSDKProxyTests" name="test_pushAdmin_deviceRegistrations_addsWrapperSDKAgentToRequests()" time="0.16760003566741943">
        </testcase>
        <testcase classname="WrapperSDKProxyTests" name="test_pushChannel_addsWrapperSDKAgentToRequests()" time="0.1989760398864746">
        </testcase>
        <testcase classname="WrapperSDKProxyTests" name="test_request_addsWrapperSDKAgentToHeader()" time="0.15871000289916992">
        </testcase>
        <testcase classname="WrapperSDKProxyTests" name="test_request_firstAndNext_addWrapperSDKAgentToHeader()" time="1.1798440217971802">
        </testcase>
        <testcase classname="WrapperSDKProxyTests" name="test_sharesChannelMessageSubscriptionsWithUnderlyingChannel()" time="0.3582409620285034">
        </testcase>
        <testcase classname="WrapperSDKProxyTests" name="test_sharesChannelStateSubscriptionsWithUnderlyingChannel()" time="0.32888102531433105">
        </testcase>
        <testcase classname="WrapperSDKProxyTests" name="test_sharesChannelStateWithUnderlyingChannel()" time="0.38506197929382324">
        </testcase>
        <testcase classname="WrapperSDKProxyTests" name="test_sharesConnectionStateWithUnderlyingClient()" time="0.3216099739074707">
        </testcase>
        <testcase classname="WrapperSDKProxyTests" name="test_sharesConnectionSubscriptionsWithUnderlyingRealtimeClient()" time="0.25270700454711914">
        </testcase>
        <testcase classname="WrapperSDKProxyTests" name="test_stats_addsWrapperSDKAgentToRequest()" time="0.26454102993011475">
        </testcase>
        <testcase classname="WrapperSDKProxyTests" name="test_time_addsWrapperSDKAgentToRequest()" time="0.15802109241485596">
        </testcase>
    </testsuite>
    <testsuite name="AblyTestsObjC" tests="15" failures="0" skipped="0" time="0.052294015884399414">
        <properties>
          <property name="Configuration" value="Test Scheme Action"/>
        </properties>
        <testcase classname="ARTArchiveTests" name="test_art_unarchivedObjectOfClass_for_state_machine_states" time="0.025603890419006348">
        </testcase>
        <testcase classname="ARTErrorInfoTests" name="test_createFromNSError_with_nil_does_not_crash" time="0.0008599758148193359">
        </testcase>
        <testcase classname="ARTInternalLogTests" name="test_ARTLogDebug" time="0.00109100341796875">
        </testcase>
        <testcase classname="ARTInternalLogTests" name="test_ARTLogError" time="0.0009380578994750977">
        </testcase>
        <testcase classname="ARTInternalLogTests" name="test_ARTLogInfo" time="0.0005578994750976562">
        </testcase>
        <testcase classname="ARTInternalLogTests" name="test_ARTLogVerbose" time="0.002521038055419922">
        </testcase>
        <testcase classname="ARTInternalLogTests" name="test_ARTLogWarn" time="0.0007050037384033203">
        </testcase>
        <testcase classname="ARTInternalLogTests" name="test_classMethodLogger" time="0.0010470151901245117">
        </testcase>
        <testcase classname="ARTMessageVersionAndAnnotationsTests" name="test_annotations_do_not_change_when_a_nested_summary_value_is_mutated" time="0.0006819963455200195">
        </testcase>
        <testcase classname="ARTMessageVersionAndAnnotationsTests" name="test_copy_returns_the_same_instance" time="0.007295966148376465">
        </testcase>
        <testcase classname="ARTMessageVersionAndAnnotationsTests" name="test_version_does_not_change_when_its_arguments_are_mutated" time="0.0005201101303100586">
        </testcase>
        <testcase classname="ARTPubSubDeviceTests" name="test_createClient_returns_a_realtime_client_declaring_the_device_agent" time="0.0012869834899902344">
        </testcase>
        <testcase classname="ARTPubSubDeviceTests" name="test_createClientWithKey_declares_the_device_agent" time="0.004517078399658203">
        </testcase>
        <testcase classname="CryptoTest" name="testEncryptAndDecrypt" time="0.0007899999618530273">
        </testcase>
        <testcase classname="ObjcppTest" name="testPrintVersionInfo" time="0.003877997398376465">
        </testcase>
    </testsuite>
</testsuites>